Re: [greenstone-devel] - Compiling Errors - Solaris

From Tomáš Fiala
DateThu, 25 Jan 2007 13:01:42 +0100
Subject Re: [greenstone-devel] - Compiling Errors - Solaris
In-Reply-To (45B81E0E-6020305-cs-waikato-ac-nz)
Hello Katherine and Michael,

let me write you some of the biggest errors, which we fixed during the
Solaris compilation.

Errors step by step (by Marek Greško and Tomáš Fiala)

1. ./configure --with-gdbm=/usr/local --prefix=/data/http/gsdl/ (without
prexif error No. 4 occurs)

2. chmod +x to : /gsdl/configure ; gsdl/packages/IsisGdl ;
gsdl/packages/unac/configure gsdl/install-sh

3. make

4. error1 - edit makefile /gsdl/wv/wv-gs/ and add -liconv to LIBS

5. error2 - removing wget from /gsdl/packages/makefile (it is in my
system, but it would be possible to compile gsdl without removing
it)

6. error3 - removing expat and cpan/XML-Parser-2.34 from
/gsdl/packages/makefile (it is in my system, but it would be possible to
compile gsdl without removing it)

7. error4 - adding --prefix=/data/http/gsdl/

8. error5 - adding #include <wchar.h> to all important *.cpp files in
gsdl/src/mgpp/text
to files : mgpp_passes.cpp Queryer.cpp mgpp_fast_comp_dict.cpp
mgpp_compression_dict.cpp mgpp_invf_dict_dump.cpp mgpp_stem_idx.cpp
mgpp_invf_dict.cpp mgpp_weights_build.cpp mgpp_invf_dump.cpp
mgpp_perf_hash_build.cpp mgpp_decompress_text.cpp ivf.pass2.cpp
- adding -liconv to makefile LIBS in gsdl/src/mgpp/text

9. error6 - expat is already in system why ist gsdl using it ? i deleted
the "new" "created" folders in /gsdl/packages/expat

10. error7 - adding #include <wchar.h> to /gsdl/src/recpt/
collectoraction.cpp depositoraction.cpp wizardaction.cpp

11. error8 - adding -liconv to /export/home/gsdl/gsdl/src/recpt/makefile
LIBS

12. error9 - error9 - add #include <wchar.h> in getpw.o
/export/home/gsdl/gsdl/src/getpw

13. error10 - adding -liconv to
/export/home/gsdl/gsdl/src/oaiservr/makefile LIBS

14. make install

15. make folder /gsdl/bin/solaris copy in it files from /gsdl/bin/linux

16. Done

This installation seems to work fine on Solaris, but i need more time to
test it.

Please allow me to say thanks to Marek Greško (computer science engineer).

Sincerely,

Tomáš Fiala

--
Department of digitization
University library Bratislava
http://www.ulib.sk


Katherine Don wrote / napísal(a):
> Hi Tomas
>
> Yes, please send us a list of all your errors and what you did to fix
> them, and we'll look at incorporating the fixes into the next release of
> greenstone.
>
> Thanks,
> Katherine
>
> Tomáš Fiala wrote:
>
>> Hi Katherine,
>>
>> thanks for your solution ! I finally finished compiling Greenstone,
>> because of the many problems it took about 5 days. :-) Maybe i can save
>> your time sending you almost all of the errors.
>>
>> I will try to make a new installation ASAP, because without PDFtoHTML it
>> is not nice.I hope that someone will fix ALL the small bugs which
>> occurred during the compilation, note that the same bugs were also in
>> version 2.71.
>>
>> Sincerely,
>>
>> Tomáš Fiala
>>
>> Katherine Don wrote / napísal(a):
>>
>>
>>> Hi Tomas
>>>
>>> Just tried to compile greenstone on a Mac, and got the same error as
>>> you. (No Makefile for pdftohtml) To fix this error, you need to edit
>>> gsdl/packages/configure and change the line
>>> ENVIRONMENT="LDFLAGS=-static"
>>> to
>>> ENVIRONMENT=""
>>>
>>> That was added by mistake (its something we use when creating a release
>>> on Linux).
>>>
>>> Regards,
>>> Katherine
>>>
>>> Tomáš Fiala wrote:
>>>
>>>
>>>
>>>> Hi all,
>>>>
>>>> more serious error occurs after submitting "make" command (see
>>>> http://img387.imageshack.us/img387/4659/3kw6.jpg).
>>>>
>>>> Interesting is, that there is no rule "all" in makefile. Now I don't now
>>>> what to do next, maybe I should edit makefile and delete processing of
>>>> the whole "bad" folder.
>>>>
>>>> Does someone has better idea ?
>>>>
>>>> Sincerely,
>>>>
>>>> Tomáš Fiala
>>>>
>>>>
>>>> Tomáš Fiala wrote / napísal(a):
>>>>
>>>>
>>>>
>>>>
>>>>> I solved the problem with chmod +x to all configuration files.
>>>>>
>>>>> Tomáš Fiala wrote / napísal(a):
>>>>>
>>>>>
>>>>>
>>>>>
>>>>>> Hello everyone,
>>>>>>
>>>>>> yesterday i tried to compile Greenstone 2.72 on Solaris and I must say
>>>>>> it is quite hard.
>>>>>>
>>>>>> Does someone know how to cope with these errors
>>>>>> (http://img464.imageshack.us/img464/6650/configureerrorvl6.png) ?
>>>>>>
>>>>>> I used these commands :
>>>>>>
>>>>>> chmod +x ./configure
>>>>>>
>>>>>> ./configure --prefix=/data/http/gsdl
>>>>>>
>>>>>> Thanks for help !
>>>>>>
>>>>>> I will try to continue the process today, i hope that i will succeed.
>>>>>>
>>>>>> Sincerely,
>>>>>>
>>>>>> Tomáš Fiala
>>>>>>
>>>>>> ------------------------------------------------------------------------
>>>>>>
>>>>>>
>>>>>> _______________________________________________
>>>>>> greenstone-devel mailing list
>>>>>> greenstone-devel@list.scms.waikato.ac.nz
>>>>>> https://list.scms.waikato.ac.nz/mailman/listinfo/greenstone-devel
>>>>>>
>>>>>>
>>>>>
>>>>>
>>>> ------------------------------------------------------------------------
>>>>
>>>> _______________________________________________
>>>> greenstone-devel mailing list
>>>> greenstone-devel@list.scms.waikato.ac.nz
>>>> https://list.scms.waikato.ac.nz/mailman/listinfo/greenstone-devel
>>>>
>>>>
>>>
>>>
>>
>
>


<<attachment>>
Type: text/plain
Filename: errors.txt

Error1

expat/xmlparse/hashtable.o expat/xmltok/xmltok.o expat/xmltok/xmlrole.o libole2/ms-ole.o libole2/ms-ole-summary.o oledecod/oledecod.o
ranlib libwv.a
make OLEDECODE BLIBOLE2
make[3]: Entering directory `/export/home/gsdl/gsdl/packages/wv/wv-gs'
making oledecod in oledecod
make[4]: Entering directory `/export/home/gsdl/gsdl/packages/wv/wv-gs/oledecod'
make[4]: Nothing to be done for `all'.
make[4]: Leaving directory `/export/home/gsdl/gsdl/packages/wv/wv-gs/oledecod'
not making glib-wv... using system glib instead
making libole2 in libole2
make[4]: Entering directory `/export/home/gsdl/gsdl/packages/wv/wv-gs/libole2'
make[4]: Nothing to be done for `all'.
make[4]: Leaving directory `/export/home/gsdl/gsdl/packages/wv/wv-gs/libole2'
make[3]: Leaving directory `/export/home/gsdl/gsdl/packages/wv/wv-gs'
gcc -o wvWare wvWare.o -L. -lwv -L/usr/sfw/lib -L/gates/sfw10/builds/sfw10-gate/proto/root_sparc/usr/sfw/lib -L/usr/sfw/lib -L/usr/lib -L/usr/X/lib -R/usr/sfw/lib:/usr/lib:/usr/X/lib -L/usr/openwin/lib -R/usr/openwin/lib -L/usr/sfw/lib -L/usr/lib -lpng -lz -L/usr/sfw/lib -R/usr/sfw/lib -lglib -lm
Undefined first referenced
symbol in file
libiconv_close ./libwv.a(text.o)
libiconv_open ./libwv.a(text.o)
libiconv ./libwv.a(text.o)
ld: fatal: Symbol referencing errors. No output written to wvWare
collect2: ld returned 1 exit status
make[2]: *** [wvWare] Error 1
make[2]: Leaving directory `/export/home/gsdl/gsdl/packages/wv/wv-gs'
make[1]: *** [all] Error 1
make[1]: Leaving directory `/export/home/gsdl/gsdl/packages'
make: *** [all] Error 1

Error2

_gs/src'
g++ -g -O2 -DHAVE_DIRENT_H=1 -I.. -DHAVE_REWINDDIR=1 -DHAVE_POPEN=1 -I../goo -I. -I../xpdf -c HtmlOutputDev.cc
g++ -g -O2 -DHAVE_DIRENT_H=1 -I.. -DHAVE_REWINDDIR=1 -DHAVE_POPEN=1 -I../goo -I. -I../xpdf -c HtmlFonts.cc
g++ -g -O2 -DHAVE_DIRENT_H=1 -I.. -DHAVE_REWINDDIR=1 -DHAVE_POPEN=1 -I../goo -I. -I../xpdf -c HtmlLinks.cc
g++ -g -O2 -DHAVE_DIRENT_H=1 -I.. -DHAVE_REWINDDIR=1 -DHAVE_POPEN=1 -I../goo -I. -I../xpdf -c pdftohtml.cc
g++ -g -O2 -DHAVE_DIRENT_H=1 -I.. -DHAVE_REWINDDIR=1 -DHAVE_POPEN=1 -I../goo -I. -I../xpdf -o pdftohtml HtmlOutputDev.o HtmlFonts.o HtmlLinks.o pdftohtml.o
-L../goo -L../xpdf -lXpdf -lGoo -lm
make[3]: Leaving directory `/export/home/gsdl/gsdl/packages/pdftohtml/pdftohtml_gs/src'
mv src/pdftohtml ./pdftohtml
make[2]: Leaving directory `/export/home/gsdl/gsdl/packages/pdftohtml/pdftohtml_gs'
making all in wget/wget-1.9
make[2]: Entering directory `/export/home/gsdl/gsdl/packages/wget/wget-1.9'
echo timestamp > stamp-h.in
cd src && make CC='gcc' CPPFLAGS='' DEFS='-DHAVE_CONFIG_H -DSYSTEM_WGETRC="/export/home/gsdl/gsdl/packages/wget/etc/wgetrc" -DLOCALEDIR="/export/home/gsdl/gsdl/packages/wget/share/locale"' CFLAGS='-O2 -Wall -Wno-implicit' LDFLAGS='' LIBS='-lintl -lmd5 -lssl -lcrypto -ldl -lsocket -lnsl ' prefix='/export/home/gsdl/gsdl/packages/wget' exec_prefix='/export/home/gsdl/gsdl/packages/wget' bindir='/export/home/gsdl/gsdl/bin/sunos' infodir='/export/home/gsdl/gsdl/packages/wget/info' mandir='/export/home/gsdl/gsdl/packages/wget/man' manext='1'
make[3]: Entering directory `/export/home/gsdl/gsdl/packages/wget/wget-1.9/src'
gcc -I. -I. -DHAVE_CONFIG_H -DSYSTEM_WGETRC="/export/home/gsdl/gsdl/packages/wget/etc/wgetrc" -DLOCALEDIR="/export/home/gsdl/gsdl/packages/wget/share/locale" -O2 -Wall -Wno-implicit -c cmpt.c
gcc -I. -I. -DHAVE_CONFIG_H -DSYSTEM_WGETRC="/export/home/gsdl/gsdl/packages/wget/etc/wgetrc" -DLOCALEDIR="/export/home/gsdl/gsdl/packages/wget/share/locale" -O2 -Wall -Wno-implicit -c connect.c
gcc -I. -I. -DHAVE_CONFIG_H -DSYSTEM_WGETRC="/export/home/gsdl/gsdl/packages/wget/etc/wgetrc" -DLOCALEDIR="/export/home/gsdl/gsdl/packages/wget/share/locale" -O2 -Wall -Wno-implicit -c convert.c
gcc -I. -I. -DHAVE_CONFIG_H -DSYSTEM_WGETRC="/export/home/gsdl/gsdl/packages/wget/etc/wgetrc" -DLOCALEDIR="/export/home/gsdl/gsdl/packages/wget/share/locale" -O2 -Wall -Wno-implicit -c cookies.c
gcc -I. -I. -DHAVE_CONFIG_H -DSYSTEM_WGETRC="/export/home/gsdl/gsdl/packages/wget/etc/wgetrc" -DLOCALEDIR="/export/home/gsdl/gsdl/packages/wget/share/locale" -O2 -Wall -Wno-implicit -c ftp.c
In file included from /usr/sfw/include/openssl/ssl.h:183,
from rbuf.h:34,
from ftp.c:50:
/usr/sfw/include/openssl/bio.h:615: error: syntax error before "va_list"
/usr/sfw/include/openssl/bio.h:617: error: syntax error before "va_list"
make[3]: *** [ftp.o] Error 1
make[3]: Leaving directory `/export/home/gsdl/gsdl/packages/wget/wget-1.9/src'
make[2]: *** [src] Error 2
make[2]: Leaving directory `/export/home/gsdl/gsdl/packages/wget/wget-1.9'
make[1]: *** [all] Error 1
make[1]: Leaving directory `/export/home/gsdl/gsdl/packages'
make: *** [all] Error 1

Error3

ion has no type or storage class
/export/home/gsdl/gsdl/packages/expat/include/expat.h:902: error: syntax error before "XML_GetCurrentByteIndex"
/export/home/gsdl/gsdl/packages/expat/include/expat.h:902: warning: data definition has no type or storage class
/export/home/gsdl/gsdl/packages/expat/include/expat.h:908: error: syntax error before "XML_GetCurrentByteCount"
/export/home/gsdl/gsdl/packages/expat/include/expat.h:908: warning: data definition has no type or storage class
/export/home/gsdl/gsdl/packages/expat/include/expat.h:921: error: syntax error before "XML_GetInputContext"
/export/home/gsdl/gsdl/packages/expat/include/expat.h:923: warning: data definition has no type or storage class
/export/home/gsdl/gsdl/packages/expat/include/expat.h:932: error: syntax error before "XML_FreeContentModel"
/export/home/gsdl/gsdl/packages/expat/include/expat.h:932: warning: data definition has no type or storage class
/export/home/gsdl/gsdl/packages/expat/include/expat.h:936: error: syntax error before "XML_MemMalloc"
/export/home/gsdl/gsdl/packages/expat/include/expat.h:936: warning: data definition has no type or storage class
/export/home/gsdl/gsdl/packages/expat/include/expat.h:939: error: syntax error before "XML_MemRealloc"
/export/home/gsdl/gsdl/packages/expat/include/expat.h:939: warning: data definition has no type or storage class
/export/home/gsdl/gsdl/packages/expat/include/expat.h:942: error: syntax error before "XML_MemFree"
/export/home/gsdl/gsdl/packages/expat/include/expat.h:942: warning: data definition has no type or storage class
/export/home/gsdl/gsdl/packages/expat/include/expat.h:946: error: syntax error before "XML_ParserFree"
/export/home/gsdl/gsdl/packages/expat/include/expat.h:946: warning: data definition has no type or storage class
/export/home/gsdl/gsdl/packages/expat/include/expat.h:949: error: syntax error before '*' token
/export/home/gsdl/gsdl/packages/expat/include/expat.h:950: warning: data definition has no type or storage class
/export/home/gsdl/gsdl/packages/expat/include/expat.h:953: error: syntax error before '*' token
/export/home/gsdl/gsdl/packages/expat/include/expat.h:954: warning: data definition has no type or storage class
/export/home/gsdl/gsdl/packages/expat/include/expat.h:966: error: syntax error before "XML_ExpatVersionInfo"
/export/home/gsdl/gsdl/packages/expat/include/expat.h:966: warning: data definition has no type or storage class
/export/home/gsdl/gsdl/packages/expat/include/expat.h:983: warning: no semicolon at end of struct or union
/export/home/gsdl/gsdl/packages/expat/include/expat.h:983: error: syntax error before '*' token
/export/home/gsdl/gsdl/packages/expat/include/expat.h:985: error: syntax error before '}' token
/export/home/gsdl/gsdl/packages/expat/include/expat.h:985: warning: data definition has no type or storage class
/export/home/gsdl/gsdl/packages/expat/include/expat.h:987: error: syntax error before '*' token
/export/home/gsdl/gsdl/packages/expat/include/expat.h:988: warning: data definition has no type or storage class
Expat.xs:111: error: syntax error before "nsdelim"
Expat.xs:111: warning: data definition has no type or storage class
Expat.xs: In function `generate_model':
Expat.xs:255: error: dereferencing pointer to incomplete type
Expat.xs:256: error: dereferencing pointer to incomplete type
Expat.xs:257: error: dereferencing pointer to incomplete type
Expat.xs:260: error: dereferencing pointer to incomplete type
Expat.xs:262: error: dereferencing pointer to incomplete type
Expat.xs:268: error: dereferencing pointer to incomplete type
Expat.xs:268: error: dereferencing pointer to incomplete type
Expat.xs:273: error: dereferencing pointer to incomplete type
Expat.xs:274: error: dereferencing pointer to incomplete type
Expat.xs: In function `parse_stream':
Expat.xs:350: warning: initialization makes pointer from integer without a cast
Expat.xs: At top level:
Expat.xs:668: error: syntax error before '*' token
Expat.xs: In function `nsStart':
Expat.xs:670: error: `userdata' undeclared (first use in this function)
Expat.xs:670: error: (Each undeclared identifier is reported only once
Expat.xs:670: error: for each function it appears in.)
Expat.xs:678: error: `prefix' undeclared (first use in this function)
Expat.xs:679: error: `uri' undeclared (first use in this function)
Expat.xs: At top level:
Expat.xs:688: error: syntax error before '*' token
Expat.xs: In function `nsEnd':
Expat.xs:690: error: `userdata' undeclared (first use in this function)
Expat.xs:698: error: `prefix' undeclared (first use in this function)
Expat.xs: In function `externalEntityRef':
Expat.xs:1007: warning: assignment makes pointer from integer without a cast
Expat.xs: At top level:
Expat.xs:1115: error: syntax error before "XML_Encoding"
Expat.xs: In function `unknownEncoding':
Expat.xs:1123: error: `name' undeclared (first use in this function)
Expat.xs:1167: error: `info' undeclared (first use in this function)
Expat.xs: In function `suspend_callbacks':
Expat.xs:1199: error: `XML_CharacterDataHandler' undeclared (first use in this function)
Expat.xs:1199: error: syntax error before numeric constant
Expat.xs:1204: error: `XML_ProcessingInstructionHandler' undeclared (first use in this function)
Expat.xs:1204: error: syntax error before numeric constant
Expat.xs:1209: error: `XML_CommentHandler' undeclared (first use in this function)
Expat.xs:1209: error: syntax error before numeric constant
Expat.xs:1215: error: `XML_StartCdataSectionHandler' undeclared (first use in this function)
Expat.xs:1215: error: syntax error before numeric constant
Expat.xs:1221: error: `XML_UnparsedEntityDeclHandler' undeclared (first use in this function)
Expat.xs:1221: error: syntax error before numeric constant
Expat.xs:1226: error: `XML_NotationDeclHandler' undeclared (first use in this function)
Expat.xs:1226: error: syntax error before numeric constant
Expat.xs:1231: error: `XML_ExternalEntityRefHandler' undeclared (first use in this function)
Expat.xs:1231: error: syntax error before numeric constant
Expat.xs: In function `XS_XML__Parser__Expat_ParserCreate':
Expat.xs:1320: warning: assignment makes pointer from integer without a cast
Expat.xs:1325: warning: assignment makes pointer from integer without a cast
Expat.xs: In function `XS_XML__Parser__Expat_SetCharacterDataHandler':
Expat.xs:1540: error: `XML_CharacterDataHandler' undeclared (first use in this function)
Expat.xs:1540: error: syntax error before "charhndl"
Expat.xs:1545: error: `charhndl' undeclared (first use in this function)
Expat.xs: In function `XS_XML__Parser__Expat_SetProcessingInstructionHandler':
Expat.xs:1557: error: `XML_ProcessingInstructionHandler' undeclared (first use in this function)
Expat.xs:1557: error: syntax error before "prochndl"
Expat.xs:1563: error: `prochndl' undeclared (first use in this function)
Expat.xs: In function `XS_XML__Parser__Expat_SetCommentHandler':
Expat.xs:1575: error: `XML_CommentHandler' undeclared (first use in this function)
Expat.xs:1575: error: syntax error before "cmnthndl"
Expat.xs:1580: error: `cmnthndl' undeclared (first use in this function)
Expat.xs: In function `XS_XML__Parser__Expat_SetDefaultHandler':
Expat.xs:1592: error: `XML_DefaultHandler' undeclared (first use in this function)
Expat.xs:1592: error: syntax error before "dflthndl"
Expat.xs:1597: error: `dflthndl' undeclared (first use in this function)
Expat.xs: In function `XS_XML__Parser__Expat_SetUnparsedEntityDeclHandler':
Expat.xs:1613: error: `XML_UnparsedEntityDeclHandler' undeclared (first use in this function)
Expat.xs:1613: error: syntax error before "unprsdhndl"
Expat.xs:1619: error: `unprsdhndl' undeclared (first use in this function)
Expat.xs: In function `XS_XML__Parser__Expat_SetNotationDeclHandler':
Expat.xs:1631: error: `XML_NotationDeclHandler' undeclared (first use in this function)
Expat.xs:1631: error: syntax error before "nothndlr"
Expat.xs:1636: error: `nothndlr' undeclared (first use in this function)
Expat.xs: In function `XS_XML__Parser__Expat_SetExternalEntityRefHandler':
Expat.xs:1648: error: `XML_ExternalEntityRefHandler' undeclared (first use in this function)
Expat.xs:1648: error: syntax error before "exthndlr"
Expat.xs:1654: error: `exthndlr' undeclared (first use in this function)
Expat.xs: In function `XS_XML__Parser__Expat_SetEntityDeclHandler':
Expat.xs:1683: error: `XML_EntityDeclHandler' undeclared (first use in this function)
Expat.xs:1683: error: syntax error before "enthndlr"
Expat.xs:1689: error: `enthndlr' undeclared (first use in this function)
Expat.xs: In function `XS_XML__Parser__Expat_SetElementDeclHandler':
Expat.xs:1701: error: `XML_ElementDeclHandler' undeclared (first use in this function)
Expat.xs:1701: error: syntax error before "eldeclhndlr"
Expat.xs:1707: error: `eldeclhndlr' undeclared (first use in this function)
Expat.xs: In function `XS_XML__Parser__Expat_SetAttListDeclHandler':
Expat.xs:1719: error: `XML_AttlistDeclHandler' undeclared (first use in this function)
Expat.xs:1719: error: syntax error before "attdeclhndlr"
Expat.xs:1725: error: `attdeclhndlr' undeclared (first use in this function)
Expat.xs: In function `XS_XML__Parser__Expat_SetDoctypeHandler':
Expat.xs:1737: error: `XML_StartDoctypeDeclHandler' undeclared (first use in this function)
Expat.xs:1737: error: syntax error before "dtsthndlr"
Expat.xs:1744: error: `dtsthndlr' undeclared (first use in this function)Expat.xs: In function `XS_XML__Parser__Expat_SetEndDoctypeHandler':
Expat.xs:1756: error: `XML_EndDoctypeDeclHandler' undeclared (first use in this function)
Expat.xs:1756: error: syntax error before "dtendhndlr"
Expat.xs:1762: error: `dtendhndlr' undeclared (first use in this function)
Expat.xs: In function `XS_XML__Parser__Expat_SetXMLDeclHandler':
Expat.xs:1775: error: `XML_XmlDeclHandler' undeclared (first use in this function)
Expat.xs:1775: error: syntax error before "xmldechndlr"
Expat.xs:1781: error: `xmldechndlr' undeclared (first use in this function)
Expat.xs: In function `XS_XML__Parser__Expat_GetBase':
Expat.xs:1812: warning: initialization makes pointer from integer without a cast
Expat.xs: In function `XS_XML__Parser__Expat_PositionContext':
Expat.xs:1829: warning: initialization makes pointer from integer without a cast
Expat.xs: In function `XS_XML__Parser__Expat_RecognizedString':
Expat.xs:1930: error: `XML_DefaultHandler' undeclared (first use in this function)
Expat.xs:1930: error: syntax error before "dflthndl"
Expat.xs:1934: error: `dflthndl' undeclared (first use in this function)
Expat.xs: In function `XS_XML__Parser__Expat_ErrorString':
Expat.xs:1983: warning: initialization makes pointer from integer without a cast
Expat.xs: In function `XS_XML__Parser__Expat_OriginalString':
Expat.xs:2091: warning: initialization makes pointer from integer without a cast
Expat.xs: In function `XS_XML__Parser__Expat_SetStartCdataHandler':
Expat.xs:2110: error: `XML_StartCdataSectionHandler' undeclared (first use in this function)
Expat.xs:2110: error: syntax error before "scdhndl"
Expat.xs:2115: error: `scdhndl' undeclared (first use in this function)
Expat.xs: In function `XS_XML__Parser__Expat_SetEndCdataHandler':
Expat.xs:2128: error: `XML_EndCdataSectionHandler' undeclared (first use in this function)
Expat.xs:2128: error: syntax error before "ecdhndl"
Expat.xs:2133: error: `ecdhndl' undeclared (first use in this function)
Expat.xs: In function `XS_XML__Parser__Expat_UnsetAllHandlers':
Expat.xs:2149: error: `XML_StartNamespaceDeclHandler' undeclared (first use in this function)
Expat.xs:2149: error: syntax error before numeric constant
Expat.xs:2154: error: `XML_StartElementHandler' undeclared (first use in this function)
Expat.xs:2154: error: syntax error before numeric constant
Expat.xs:2158: error: `XML_UnknownEncodingHandler' undeclared (first use in this function)
Expat.xs:2158: error: syntax error before numeric constant
make[3]: *** [Expat.o] Error 1
make[3]: Leaving directory `/export/home/gsdl/gsdl/packages/cpan/XML-Parser-2.34/Expat'
make[2]: *** [subdirs] Error 2
make[2]: Leaving directory `/export/home/gsdl/gsdl/packages/cpan/XML-Parser-2.34'
make[1]: *** [all] Error 1
make[1]: Leaving directory `/export/home/gsdl/gsdl/packages'
make: *** [all] Error 1

Error4

disp.lo cclfind.lo ccltoken.lo cclerrms.lo cclqual.lo cclptree.lo cclqfile.lo cclstr.lo cql.lo cqlstdio.lo cqltransform.lo cqlutil.lo xcqlutil.lo cqlstring.lo cqlstrer.lo eventl.lo seshigh.lo statserv.lo requestq.lo tcpdchk.lo service.lo -L/usr/lib -R/usr/lib -lxml2 -lz -lpthread -lm -lsocket -lnsl -lsocket -lnsl -liconv
mkdir .libs
ar cru .libs/libyaz.a version.o options.o log.o marcdisp.o oid.o wrbuf.o nmemsdup.o xmalloc.o readconf.o tpath.o nmem.o matchstr.o atoin.o siconv.o marc8.o odr_bool.o ber_bool.o ber_len.o ber_tag.o odr_util.o odr_null.o ber_null.o odr_int.o ber_int.o odr_tag.o odr_cons.o odr_seq.o odr_oct.o ber_oct.o odr_bit.o ber_bit.o odr_oid.o ber_oid.o odr_use.o odr_choice.o odr_any.o ber_any.o odr.o odr_mem.o dumpber.o odr_enum.o comstack.o tcpip.o waislen.o unix.o z-accdes1.o z-accform1.o z-acckrb1.o z-core.o z-diag1.o z-espec1.o z-estask.o z-exp.o z-grs.o z-mterm2.o z-opac.o z-uifr1.o z-rrf1.o z-rrf2.o z-sum.o z-sutrs.o z-oclcui.o zes-expi.o zes-exps.o zes-order.o zes-pquery.o zes-psched.o zes-pset.o zes-update0.o z-date.o z-univ.o zes-update.o zes-admin.o z-charneg.o prt-ext.o ill-core.o item-req.o ill-get.o zget.o yaz-ccl.o diag-entry.o diagbib1.o diagsrw.o logrpn.o otherinfo.o pquery.o sortspec.o z3950oid.o charneg.o initopt.o zoom-c.o zoom-opt.o grs1disp.o zgdu.o soap.o srw.o srwutil.o opacdisp.o cclfind.o ccltoken.o cclerrms.o cclqual.o cclptree.o cclqfile.o cclstr.o cql.o cqlstdio.o cqltransform.o cqlutil.o xcqlutil.o cqlstring.o cqlstrer.o eventl.o seshigh.o statserv.o requestq.o tcpdchk.o service.o
ranlib .libs/libyaz.a
creating libyaz.la
(cd .libs && rm -f libyaz.la && ln -s ../libyaz.la libyaz.la)
/bin/bash ../libtool --mode=compile gcc -DPACKAGE_NAME="" -DPACKAGE_TARNAME="" -DPACKAGE_VERSION="" -DPACKAGE_STRING="" -DPACKAGE_BUGREPORT="" -DPACKAGE="yaz" -DVERSION="2.1.4" -DSTDC_HEADERS=1 -DHAVE_SYS_TYPES_H=1 -DHAVE_SYS_STAT_H=1 -DHAVE_STDLIB_H=1 -DHAVE_STRING_H=1 -DHAVE_MEMORY_H=1 -DHAVE_STRINGS_H=1 -DHAVE_INTTYPES_H=1 -DHAVE_STDINT_H=1 -DHAVE_UNISTD_H=1 -DHAVE_DLFCN_H=1 -DHAVE_DIRENT_H=1 -DHAVE_FNMATCH_H=1 -DHAVE_WCHAR_H=1 -DHAVE_LOCALE_H=1 -DHAVE_LANGINFO_H=1 -DHAVE_PWD_H=1 -DHAVE_SYS_POLL_H=1 -DHAVE_SYS_SELECT_H=1 -DHAVE_SYS_SOCKET_H=1 -DHAVE_SYS_STAT_H=1 -DHAVE_SYS_TIME_H=1 -DHAVE_SYS_TYPES_H=1 -DHAVE_SYS_UN_H=1 -DHAVE_SYS_WAIT_H=1 -DHAVE_UNISTD_H=1 -DSTDC_HEADERS=1 -DHAVE_LONG_LONG=1 -DHAVE_ICONV_H=1 -DHAVE_VSNPRINTF=1 -DHAVE_GETTIMEOFDAY=1 -DHAVE_POLL=1 -DHAVE_STRERROR_R=1 -DHAVE_USLEEP=1 -DHAVE_SYS_POLL_H=1 -DYAZ_SOCKLEN_T=int -DYAZ_USE_NEW_LOG=1 -DHAVE_LIBPTHREAD=1 -DHAVE_XML2=1 -I. -I. -I../include -I/usr/include/libxml2 -g -O2 -DYAZ_POSIX_THREADS=1 -D_REENTRANT -c ./nmem.c -o thr-nmem.lo
gcc -DPACKAGE_NAME="" -DPACKAGE_TARNAME="" -DPACKAGE_VERSION="" -DPACKAGE_STRING="" -DPACKAGE_BUGREPORT="" -DPACKAGE="yaz" -DVERSION="2.1.4" -DSTDC_HEADERS=1 -DHAVE_SYS_TYPES_H=1 -DHAVE_SYS_STAT_H=1 -DHAVE_STDLIB_H=1 -DHAVE_STRING_H=1 -DHAVE_MEMORY_H=1 -DHAVE_STRINGS_H=1 -DHAVE_INTTYPES_H=1 -DHAVE_STDINT_H=1 -DHAVE_UNISTD_H=1 -DHAVE_DLFCN_H=1 -DHAVE_DIRENT_H=1 -DHAVE_FNMATCH_H=1 -DHAVE_WCHAR_H=1 -DHAVE_LOCALE_H=1 -DHAVE_LANGINFO_H=1 -DHAVE_PWD_H=1 -DHAVE_SYS_POLL_H=1 -DHAVE_SYS_SELECT_H=1 -DHAVE_SYS_SOCKET_H=1 -DHAVE_SYS_STAT_H=1 -DHAVE_SYS_TIME_H=1 -DHAVE_SYS_TYPES_H=1 -DHAVE_SYS_UN_H=1 -DHAVE_SYS_WAIT_H=1 -DHAVE_UNISTD_H=1 -DSTDC_HEADERS=1 -DHAVE_LONG_LONG=1 -DHAVE_ICONV_H=1 -DHAVE_VSNPRINTF=1 -DHAVE_GETTIMEOFDAY=1 -DHAVE_POLL=1 -DHAVE_STRERROR_R=1 -DHAVE_USLEEP=1 -DHAVE_SYS_POLL_H=1 -DYAZ_SOCKLEN_T=int -DYAZ_USE_NEW_LOG=1 -DHAVE_LIBPTHREAD=1 -DHAVE_XML2=1 -I. -I. -I../include -I/usr/include/libxml2 -g -O2 -DYAZ_POSIX_THREADS=1 -D_REENTRANT -c ./nmem.c -o thr-nmem.o
/bin/bash ../libtool --mode=compile gcc -DPACKAGE_NAME="" -DPACKAGE_TARNAME="" -DPACKAGE_VERSION="" -DPACKAGE_STRING="" -DPACKAGE_BUGREPORT="" -DPACKAGE="yaz" -DVERSION="2.1.4" -DSTDC_HEADERS=1 -DHAVE_SYS_TYPES_H=1 -DHAVE_SYS_STAT_H=1 -DHAVE_STDLIB_H=1 -DHAVE_STRING_H=1 -DHAVE_MEMORY_H=1 -DHAVE_STRINGS_H=1 -DHAVE_INTTYPES_H=1 -DHAVE_STDINT_H=1 -DHAVE_UNISTD_H=1 -DHAVE_DLFCN_H=1 -DHAVE_DIRENT_H=1 -DHAVE_FNMATCH_H=1 -DHAVE_WCHAR_H=1 -DHAVE_LOCALE_H=1 -DHAVE_LANGINFO_H=1 -DHAVE_PWD_H=1 -DHAVE_SYS_POLL_H=1 -DHAVE_SYS_SELECT_H=1 -DHAVE_SYS_SOCKET_H=1 -DHAVE_SYS_STAT_H=1 -DHAVE_SYS_TIME_H=1 -DHAVE_SYS_TYPES_H=1 -DHAVE_SYS_UN_H=1 -DHAVE_SYS_WAIT_H=1 -DHAVE_UNISTD_H=1 -DSTDC_HEADERS=1 -DHAVE_LONG_LONG=1 -DHAVE_ICONV_H=1 -DHAVE_VSNPRINTF=1 -DHAVE_GETTIMEOFDAY=1 -DHAVE_POLL=1 -DHAVE_STRERROR_R=1 -DHAVE_USLEEP=1 -DHAVE_SYS_POLL_H=1 -DYAZ_SOCKLEN_T=int -DYAZ_USE_NEW_LOG=1 -DHAVE_LIBPTHREAD=1 -DHAVE_XML2=1 -I. -I. -I../include -I/usr/include/libxml2 -g -O2 -DYAZ_POSIX_THREADS=1 -D_REENTRANT -c ./statserv.c -o thr-statserv.lo
gcc -DPACKAGE_NAME="" -DPACKAGE_TARNAME="" -DPACKAGE_VERSION="" -DPACKAGE_STRING="" -DPACKAGE_BUGREPORT="" -DPACKAGE="yaz" -DVERSION="2.1.4" -DSTDC_HEADERS=1 -DHAVE_SYS_TYPES_H=1 -DHAVE_SYS_STAT_H=1 -DHAVE_STDLIB_H=1 -DHAVE_STRING_H=1 -DHAVE_MEMORY_H=1 -DHAVE_STRINGS_H=1 -DHAVE_INTTYPES_H=1 -DHAVE_STDINT_H=1 -DHAVE_UNISTD_H=1 -DHAVE_DLFCN_H=1 -DHAVE_DIRENT_H=1 -DHAVE_FNMATCH_H=1 -DHAVE_WCHAR_H=1 -DHAVE_LOCALE_H=1 -DHAVE_LANGINFO_H=1 -DHAVE_PWD_H=1 -DHAVE_SYS_POLL_H=1 -DHAVE_SYS_SELECT_H=1 -DHAVE_SYS_SOCKET_H=1 -DHAVE_SYS_STAT_H=1 -DHAVE_SYS_TIME_H=1 -DHAVE_SYS_TYPES_H=1 -DHAVE_SYS_UN_H=1 -DHAVE_SYS_WAIT_H=1 -DHAVE_UNISTD_H=1 -DSTDC_HEADERS=1 -DHAVE_LONG_LONG=1 -DHAVE_ICONV_H=1 -DHAVE_VSNPRINTF=1 -DHAVE_GETTIMEOFDAY=1 -DHAVE_POLL=1 -DHAVE_STRERROR_R=1 -DHAVE_USLEEP=1 -DHAVE_SYS_POLL_H=1 -DYAZ_SOCKLEN_T=int -DYAZ_USE_NEW_LOG=1 -DHAVE_LIBPTHREAD=1 -DHAVE_XML2=1 -I. -I. -I../include -I/usr/include/libxml2 -g -O2 -DYAZ_POSIX_THREADS=1 -D_REENTRANT -c ./statserv.c -o thr-statserv.o
/bin/bash ../libtool --mode=compile gcc -DPACKAGE_NAME="" -DPACKAGE_TARNAME="" -DPACKAGE_VERSION="" -DPACKAGE_STRING="" -DPACKAGE_BUGREPORT="" -DPACKAGE="yaz" -DVERSION="2.1.4" -DSTDC_HEADERS=1 -DHAVE_SYS_TYPES_H=1 -DHAVE_SYS_STAT_H=1 -DHAVE_STDLIB_H=1 -DHAVE_STRING_H=1 -DHAVE_MEMORY_H=1 -DHAVE_STRINGS_H=1 -DHAVE_INTTYPES_H=1 -DHAVE_STDINT_H=1 -DHAVE_UNISTD_H=1 -DHAVE_DLFCN_H=1 -DHAVE_DIRENT_H=1 -DHAVE_FNMATCH_H=1 -DHAVE_WCHAR_H=1 -DHAVE_LOCALE_H=1 -DHAVE_LANGINFO_H=1 -DHAVE_PWD_H=1 -DHAVE_SYS_POLL_H=1 -DHAVE_SYS_SELECT_H=1 -DHAVE_SYS_SOCKET_H=1 -DHAVE_SYS_STAT_H=1 -DHAVE_SYS_TIME_H=1 -DHAVE_SYS_TYPES_H=1 -DHAVE_SYS_UN_H=1 -DHAVE_SYS_WAIT_H=1 -DHAVE_UNISTD_H=1 -DSTDC_HEADERS=1 -DHAVE_LONG_LONG=1 -DHAVE_ICONV_H=1 -DHAVE_VSNPRINTF=1 -DHAVE_GETTIMEOFDAY=1 -DHAVE_POLL=1 -DHAVE_STRERROR_R=1 -DHAVE_USLEEP=1 -DHAVE_SYS_POLL_H=1 -DYAZ_SOCKLEN_T=int -DYAZ_USE_NEW_LOG=1 -DHAVE_LIBPTHREAD=1 -DHAVE_XML2=1 -I. -I. -I../include -I/usr/include/libxml2 -g -O2 -DYAZ_POSIX_THREADS=1 -D_REENTRANT -c ./eventl.c -o thr-eventl.lo
gcc -DPACKAGE_NAME="" -DPACKAGE_TARNAME="" -DPACKAGE_VERSION="" -DPACKAGE_STRING="" -DPACKAGE_BUGREPORT="" -DPACKAGE="yaz" -DVERSION="2.1.4" -DSTDC_HEADERS=1 -DHAVE_SYS_TYPES_H=1 -DHAVE_SYS_STAT_H=1 -DHAVE_STDLIB_H=1 -DHAVE_STRING_H=1 -DHAVE_MEMORY_H=1 -DHAVE_STRINGS_H=1 -DHAVE_INTTYPES_H=1 -DHAVE_STDINT_H=1 -DHAVE_UNISTD_H=1 -DHAVE_DLFCN_H=1 -DHAVE_DIRENT_H=1 -DHAVE_FNMATCH_H=1 -DHAVE_WCHAR_H=1 -DHAVE_LOCALE_H=1 -DHAVE_LANGINFO_H=1 -DHAVE_PWD_H=1 -DHAVE_SYS_POLL_H=1 -DHAVE_SYS_SELECT_H=1 -DHAVE_SYS_SOCKET_H=1 -DHAVE_SYS_STAT_H=1 -DHAVE_SYS_TIME_H=1 -DHAVE_SYS_TYPES_H=1 -DHAVE_SYS_UN_H=1 -DHAVE_SYS_WAIT_H=1 -DHAVE_UNISTD_H=1 -DSTDC_HEADERS=1 -DHAVE_LONG_LONG=1 -DHAVE_ICONV_H=1 -DHAVE_VSNPRINTF=1 -DHAVE_GETTIMEOFDAY=1 -DHAVE_POLL=1 -DHAVE_STRERROR_R=1 -DHAVE_USLEEP=1 -DHAVE_SYS_POLL_H=1 -DYAZ_SOCKLEN_T=int -DYAZ_USE_NEW_LOG=1 -DHAVE_LIBPTHREAD=1 -DHAVE_XML2=1 -I. -I. -I../include -I/usr/include/libxml2 -g -O2 -DYAZ_POSIX_THREADS=1 -D_REENTRANT -c ./eventl.c -o thr-eventl.o
/bin/bash ../libtool --mode=link gcc -g -O2 -o libyazthread.la -rpath /export/home/gsdl/gsdl/packages/yaz/lib -version-info 2:0:0 thr-nmem.lo thr-statserv.lo thr-eventl.lo -L/usr/lib -R/usr/lib -lxml2 -lz -lpthread -lm -lsocket -lnsl -lsocket -lnsl -liconv
ar cru .libs/libyazthread.a thr-nmem.o thr-statserv.o thr-eventl.o
ranlib .libs/libyazthread.a
creating libyazthread.la
(cd .libs && rm -f libyazthread.la && ln -s ../libyazthread.la libyazthread.la)
make[2]: Leaving directory `/export/home/gsdl/gsdl/packages/yaz/yaz-2.1.4/src'
making all in yaz/yaz-2.1.4/client
make[2]: Entering directory `/export/home/gsdl/gsdl/packages/yaz/yaz-2.1.4/client'
gcc -DPACKAGE_NAME="" -DPACKAGE_TARNAME="" -DPACKAGE_VERSION="" -DPACKAGE_STRING="" -DPACKAGE_BUGREPORT="" -DPACKAGE="yaz" -DVERSION="2.1.4" -DSTDC_HEADERS=1 -DHAVE_SYS_TYPES_H=1 -DHAVE_SYS_STAT_H=1 -DHAVE_STDLIB_H=1 -DHAVE_STRING_H=1 -DHAVE_MEMORY_H=1 -DHAVE_STRINGS_H=1 -DHAVE_INTTYPES_H=1 -DHAVE_STDINT_H=1 -DHAVE_UNISTD_H=1 -DHAVE_DLFCN_H=1 -DHAVE_DIRENT_H=1 -DHAVE_FNMATCH_H=1 -DHAVE_WCHAR_H=1 -DHAVE_LOCALE_H=1 -DHAVE_LANGINFO_H=1 -DHAVE_PWD_H=1 -DHAVE_SYS_POLL_H=1 -DHAVE_SYS_SELECT_H=1 -DHAVE_SYS_SOCKET_H=1 -DHAVE_SYS_STAT_H=1 -DHAVE_SYS_TIME_H=1 -DHAVE_SYS_TYPES_H=1 -DHAVE_SYS_UN_H=1 -DHAVE_SYS_WAIT_H=1 -DHAVE_UNISTD_H=1 -DSTDC_HEADERS=1 -DHAVE_LONG_LONG=1 -DHAVE_ICONV_H=1 -DHAVE_VSNPRINTF=1 -DHAVE_GETTIMEOFDAY=1 -DHAVE_POLL=1 -DHAVE_STRERROR_R=1 -DHAVE_USLEEP=1 -DHAVE_SYS_POLL_H=1 -DYAZ_SOCKLEN_T=int -DYAZ_USE_NEW_LOG=1 -DHAVE_LIBPTHREAD=1 -DHAVE_XML2=1 -I. -I. -I../include -g -O2 -c client.c
gcc -DPACKAGE_NAME="" -DPACKAGE_TARNAME="" -DPACKAGE_VERSION="" -DPACKAGE_STRING="" -DPACKAGE_BUGREPORT="" -DPACKAGE="yaz" -DVERSION="2.1.4" -DSTDC_HEADERS=1 -DHAVE_SYS_TYPES_H=1 -DHAVE_SYS_STAT_H=1 -DHAVE_STDLIB_H=1 -DHAVE_STRING_H=1 -DHAVE_MEMORY_H=1 -DHAVE_STRINGS_H=1 -DHAVE_INTTYPES_H=1 -DHAVE_STDINT_H=1 -DHAVE_UNISTD_H=1 -DHAVE_DLFCN_H=1 -DHAVE_DIRENT_H=1 -DHAVE_FNMATCH_H=1 -DHAVE_WCHAR_H=1 -DHAVE_LOCALE_H=1 -DHAVE_LANGINFO_H=1 -DHAVE_PWD_H=1 -DHAVE_SYS_POLL_H=1 -DHAVE_SYS_SELECT_H=1 -DHAVE_SYS_SOCKET_H=1 -DHAVE_SYS_STAT_H=1 -DHAVE_SYS_TIME_H=1 -DHAVE_SYS_TYPES_H=1 -DHAVE_SYS_UN_H=1 -DHAVE_SYS_WAIT_H=1 -DHAVE_UNISTD_H=1 -DSTDC_HEADERS=1 -DHAVE_LONG_LONG=1 -DHAVE_ICONV_H=1 -DHAVE_VSNPRINTF=1 -DHAVE_GETTIMEOFDAY=1 -DHAVE_POLL=1 -DHAVE_STRERROR_R=1 -DHAVE_USLEEP=1 -DHAVE_SYS_POLL_H=1 -DYAZ_SOCKLEN_T=int -DYAZ_USE_NEW_LOG=1 -DHAVE_LIBPTHREAD=1 -DHAVE_XML2=1 -I. -I. -I../include -g -O2 -c admin.c
gcc -DPACKAGE_NAME="" -DPACKAGE_TARNAME="" -DPACKAGE_VERSION="" -DPACKAGE_STRING="" -DPACKAGE_BUGREPORT="" -DPACKAGE="yaz" -DVERSION="2.1.4" -DSTDC_HEADERS=1 -DHAVE_SYS_TYPES_H=1 -DHAVE_SYS_STAT_H=1 -DHAVE_STDLIB_H=1 -DHAVE_STRING_H=1 -DHAVE_MEMORY_H=1 -DHAVE_STRINGS_H=1 -DHAVE_INTTYPES_H=1 -DHAVE_STDINT_H=1 -DHAVE_UNISTD_H=1 -DHAVE_DLFCN_H=1 -DHAVE_DIRENT_H=1 -DHAVE_FNMATCH_H=1 -DHAVE_WCHAR_H=1 -DHAVE_LOCALE_H=1 -DHAVE_LANGINFO_H=1 -DHAVE_PWD_H=1 -DHAVE_SYS_POLL_H=1 -DHAVE_SYS_SELECT_H=1 -DHAVE_SYS_SOCKET_H=1 -DHAVE_SYS_STAT_H=1 -DHAVE_SYS_TIME_H=1 -DHAVE_SYS_TYPES_H=1 -DHAVE_SYS_UN_H=1 -DHAVE_SYS_WAIT_H=1 -DHAVE_UNISTD_H=1 -DSTDC_HEADERS=1 -DHAVE_LONG_LONG=1 -DHAVE_ICONV_H=1 -DHAVE_VSNPRINTF=1 -DHAVE_GETTIMEOFDAY=1 -DHAVE_POLL=1 -DHAVE_STRERROR_R=1 -DHAVE_USLEEP=1 -DHAVE_SYS_POLL_H=1 -DYAZ_SOCKLEN_T=int -DYAZ_USE_NEW_LOG=1 -DHAVE_LIBPTHREAD=1 -DHAVE_XML2=1 -I. -I. -I../include -g -O2 -c tabcomplete.c
/bin/bash ../libtool --mode=link gcc -g -O2 -o yaz-client client.o admin.o tabcomplete.o ../src/libyaz.la -L/usr/lib -R/usr/lib -lxml2 -lz -lpthread -lm -lsocket -lnsl -lsocket -lnsl -liconv
mkdir .libs
gcc -g -O2 -o yaz-client client.o admin.o tabcomplete.o ../src/.libs/libyaz.a -L/usr/lib -lxml2 -lz -lpthread -lm -lsocket -lnsl /opt/csw/lib/libiconv.so -R/opt/csw/lib -R/opt/csw/lib -R/usr/lib
make[2]: Leaving directory `/export/home/gsdl/gsdl/packages/yaz/yaz-2.1.4/client'
making all in unac
make[2]: Entering directory `/export/home/gsdl/gsdl/packages/unac'
gcc -c -DHAVE_CONFIG_H -DUNAC_VERSION="1.7.0" -g -O2 -Wall -Wmissing-declarations -Wmissing-prototypes unac.c
unac.c: In function `convert':
unac.c:12734: warning: passing arg 2 of `libiconv' from incompatible pointer type
unac.c:12759: warning: passing arg 2 of `libiconv' from incompatible pointer type
rm -f libunac.a
ar cru libunac.a unac.o
ranlib libunac.a
make[2]: Leaving directory `/export/home/gsdl/gsdl/packages/unac'
making all in xlhtml/xlhtml-0.4.9.0
make[2]: Entering directory `/export/home/gsdl/gsdl/packages/xlhtml/xlhtml-0.4.9.0'
Making all in cole
make[3]: Entering directory `/export/home/gsdl/gsdl/packages/xlhtml/xlhtml-0.4.9.0/cole'
gcc -DHAVE_CONFIG_H -I. -I. -I.. -Wall -Wcast-align -Wpointer-arith -g -O2 -c cole.c
gcc -DHAVE_CONFIG_H -I. -I. -I.. -Wall -Wcast-align -Wpointer-arith -g -O2 -c internal.c
gcc -DHAVE_CONFIG_H -I. -I. -I.. -Wall -Wcast-align -Wpointer-arith -g -O2 -c oledecod.c
gcc -DHAVE_CONFIG_H -I. -I. -I.. -Wall -Wcast-align -Wpointer-arith -g -O2 -c olecod.c
gcc -DHAVE_CONFIG_H -I. -I. -I.. -Wall -Wcast-align -Wpointer-arith -g -O2 -c support.c
support.c: In function `fil_swriteU32':
support.c:101: warning: cast increases required alignment of target type
gcc -DHAVE_CONFIG_H -I. -I. -I.. -Wall -Wcast-align -Wpointer-arith -g -O2 -c version.c
rm -f libcole.a
ar cru libcole.a cole.o internal.o oledecod.o olecod.o support.o version.o
ranlib libcole.a
make[3]: Leaving directory `/export/home/gsdl/gsdl/packages/xlhtml/xlhtml-0.4.9.0/cole'
Making all in xlhtml
make[3]: Entering directory `/export/home/gsdl/gsdl/packages/xlhtml/xlhtml-0.4.9.0/xlhtml'
gcc -DHAVE_CONFIG_H -I. -I. -I.. -I../cole -g -O2 -c xlhtml.c
gcc -g -O2 -o xlhtml xlhtml.o ../cole/libcole.a
make[3]: Leaving directory `/export/home/gsdl/gsdl/packages/xlhtml/xlhtml-0.4.9.0/xlhtml'
Making all in ppthtml
make[3]: Entering directory `/export/home/gsdl/gsdl/packages/xlhtml/xlhtml-0.4.9.0/ppthtml'
gcc -DHAVE_CONFIG_H -I. -I. -I.. -I../cole -g -O2 -c ppthtml.c
gcc -g -O2 -o ppthtml ppthtml.o ../cole/libcole.a
make[3]: Leaving directory `/export/home/gsdl/gsdl/packages/xlhtml/xlhtml-0.4.9.0/ppthtml'
make[2]: Leaving directory `/export/home/gsdl/gsdl/packages/xlhtml/xlhtml-0.4.9.0'
making all in isis-gdl
make[2]: Entering directory `/export/home/gsdl/gsdl/packages/isis-gdl'
make[2]: *** No rule to make target `all'. Stop.
make[2]: Leaving directory `/export/home/gsdl/gsdl/packages/isis-gdl'
make[1]: *** [all] Error 1
make[1]: Leaving directory `/export/home/gsdl/gsdl/packages'
make: *** [all] Error 1
sigma:~/gsdl$

Error5

gcc -o mg_text_estimate mg_text_estimate.o locallib.o comp_dict.o mg_files.o ../../lib/libmg.a -lcrypt -lm
gcc -c -DHAVE_CONFIG_H -I../../../.. -I../.. -I../../lib -I. -O2 -DNZDL -DQUIET -DSHORT_SUFFIX -DPARADOCNUM mg_fast_comp_dict.c
gcc -o mg_fast_comp_dict mg_fast_comp_dict.o mg_files.o locallib.o ../../lib/libmg.a -lcrypt -lm
gcc -c -DHAVE_CONFIG_H -I../../../.. -I../.. -I../../lib -I. -O2 -DNZDL -DQUIET -DSHORT_SUFFIX -DPARADOCNUM mg_hilite_words.c
gcc -o mg_hilite_words mg_hilite_words.o stemmer.o locallib.o words.o environment.o ../../lib/libmg.a -lcrypt -lm
gcc -c -DHAVE_CONFIG_H -I../../../.. -I../.. -I../../lib -I. -O2 -DNZDL -DQUIET -DSHORT_SUFFIX -DPARADOCNUM mg_invf_merge.c
gcc -o mg_invf_merge mg_invf_merge.o mg_files.o locallib.o ../../lib/libmg.a -lcrypt -lm
gcc -c -DHAVE_CONFIG_H -I../../../.. -I../.. -I../../lib -I. -O2 -DNZDL -DQUIET -DSHORT_SUFFIX -DPARADOCNUM mg_text_merge.c
gcc -o mg_text_merge mg_text_merge.o mg_files.o locallib.o ../../lib/libmg.a -lcrypt -lm
gcc -c -DHAVE_CONFIG_H -I../../../.. -I../.. -I../../lib -I. -O2 -DNZDL -DQUIET -DSHORT_SUFFIX -DPARADOCNUM bool_tester.c
gcc -o bool_tester bool_tree.o bool_parser.o bool_optimiser.o bool_tester.o term_lists.o stemmer.o stem_search.o mg_errors.o query_term_list.o words.o environment.o ../../lib/libmg.a -lcrypt -lm
gcc -c -DHAVE_CONFIG_H -I../../../.. -I../.. -I../../lib -I. -O2 -DNZDL -DQUIET -DSHORT_SUFFIX -DPARADOCNUM mg_stem_idx.c
gcc -o mg_stem_idx mg_stem_idx.o mg_files.o stemmer.o locallib.o mg_errors.o term_lists.o ../../lib/libmg.a -lcrypt -lm
gcc -c -DHAVE_CONFIG_H -I../../../.. -I../.. -I../../lib -I. -O2 -DNZDL -DQUIET -DSHORT_SUFFIX -DPARADOCNUM mgstemidxlist.c
gcc -o mgstemidxlist mgstemidxlist.o mg_files.o ../../lib/libmg.a -lcrypt -lm
gcc -c -DHAVE_CONFIG_H -I../../../.. -I../.. -I../../lib -I. -O2 -DNZDL -DQUIET -DSHORT_SUFFIX -DPARADOCNUM mg_decompress_text.c
gcc -o mg_decompress_text mg_decompress_text.o query_term_list.o mg_files.o mg_errors.o text_get.o locallib.o backend.o stem_search.o term_lists.o stemmer.o weights.o invf_get.o lists.o ../../lib/libmg.a -lcrypt -lm
rm -f libtextin.a
ar cru libtextin.a query_term_list.o locallib.o lists.o query.ranked.o query.docnums.o stem_search.o environment.o commands.o weights.o text_get.o stemmer.o read_line.o mg_errors.o backend.o invf_get.o term_lists.o bool_tree.o bool_parser.o bool_optimiser.o bool_query.o
ranlib libtextin.a
make[2]: Leaving directory `/export/home/gsdl/gsdl/packages/mg/src/text'
make[1]: Leaving directory `/export/home/gsdl/gsdl/packages/mg'
making all in lib
make[1]: Entering directory `/export/home/gsdl/gsdl/lib'
g++ -c -O2 -DHAVE_CONFIG_H -I../packages/mg/lib -I.. cfgread.cpp
g++ -c -O2 -DHAVE_CONFIG_H -I../packages/mg/lib -I.. fileutil.cpp
g++ -c -O2 -DHAVE_CONFIG_H -I../packages/mg/lib -I.. text_t.cpp
g++ -c -O2 -DHAVE_CONFIG_H -I../packages/mg/lib -I.. cnfgable.cpp
g++ -c -O2 -DHAVE_CONFIG_H -I../packages/mg/lib -I.. display.cpp
g++ -c -O2 -DHAVE_CONFIG_H -I../packages/mg/lib -I.. gsdlunicode.cpp
g++ -c -O2 -DHAVE_CONFIG_H -I../packages/mg/lib -I.. gsdltimes.cpp
g++ -c -O2 -DHAVE_CONFIG_H -I../packages/mg/lib -I.. gsdltools.cpp
g++ -c -O2 -DHAVE_CONFIG_H -I../packages/mg/lib -I.. cnfgator.cpp
g++ -c -O2 -DHAVE_CONFIG_H -I../packages/mg/lib -I.. phrases.cpp
g++ -c -O2 -DHAVE_CONFIG_H -I../packages/mg/lib -I.. md5.cpp
rm -f gsdllib.a
ar cru gsdllib.a cfgread.o fileutil.o text_t.o cnfgable.o display.o gsdlunicode.o gsdltimes.o gsdltools.o cnfgator.o phrases.o md5.o
ranlib gsdllib.a
make[1]: Leaving directory `/export/home/gsdl/gsdl/lib'
making all in src/mgpp
make[1]: Entering directory `/export/home/gsdl/gsdl/src/mgpp'
for subdir in lib text; do
echo making all in $subdir;
(cd $subdir && make all) || exit 1;
done
making all in lib
make[2]: Entering directory `/export/home/gsdl/gsdl/src/mgpp/lib'
g++ -c -DHAVE_CONFIG_H -I../../.. -I. -g -O2 -D__cplusplus mgheap.cpp
g++ -c -DHAVE_CONFIG_H -I../../.. -I. -g -O2 -D__cplusplus huffman.cpp
g++ -c -DHAVE_CONFIG_H -I../../.. -I. -g -O2 -D__cplusplus messages.cpp
g++ -c -DHAVE_CONFIG_H -I../../.. -I. -g -O2 -D__cplusplus bitio_gen.cpp
g++ -c -DHAVE_CONFIG_H -I../../.. -I. -g -O2 -D__cplusplus perf_hash.cpp
g++ -c -DHAVE_CONFIG_H -I../../.. -I. -g -O2 -D__cplusplus local_strings.cpp
g++ -c -DHAVE_CONFIG_H -I../../.. -I. -g -O2 -D__cplusplus lovinstem.cpp
g++ -c -DHAVE_CONFIG_H -I../../.. -I. -g -O2 -D__cplusplus bitio_m_mem.cpp
g++ -c -DHAVE_CONFIG_H -I../../.. -I. -g -O2 -D__cplusplus bitio_m_stdio.cpp
g++ -c -DHAVE_CONFIG_H -I../../.. -I. -g -O2 -D__cplusplus bitio_m_mems.cpp
gcc -c -DHAVE_CONFIG_H -I../../.. -I. -O2 -ansi xmalloc.c
g++ -c -DHAVE_CONFIG_H -I../../.. -I. -g -O2 -D__cplusplus bitio_m_random.cpp
g++ -c -DHAVE_CONFIG_H -I../../.. -I. -g -O2 -D__cplusplus bitio_m_abstract.cpp
g++ -c -DHAVE_CONFIG_H -I../../.. -I. -g -O2 -D__cplusplus random.cpp
g++ -c -DHAVE_CONFIG_H -I../../.. -I. -g -O2 -D__cplusplus simplefrenchstem.cpp
g++ -c -DHAVE_CONFIG_H -I../../.. -I. -g -O2 -D__cplusplus unitool.cpp
rm -f libmg.a
ar cru libmg.a mgheap.o huffman.o messages.o bitio_gen.o perf_hash.o local_strings.o lovinstem.o bitio_m_mem.o bitio_m_stdio.o bitio_m_mems.o xmalloc.o bitio_m_random.o bitio_m_abstract.o random.o simplefrenchstem.o unitool.o
ranlib libmg.a
make[2]: Leaving directory `/export/home/gsdl/gsdl/src/mgpp/lib'
making all in text
make[2]: Entering directory `/export/home/gsdl/gsdl/src/mgpp/text'
g++ -c -DHAVE_CONFIG_H -I../../.. -I../lib -I. -I../../../packages/unac -g -O2 -DSILENT -DSHORT_SUFFIX -DENABLE_ACCENTFOLD mgpp_passes.cpp
mgpp_passes.cpp:23:1: warning: "_XOPEN_SOURCE" redefined
<built-in>:82:1: warning: this is the location of the previous definitionIn file included from /usr/sfw/lib/gcc/sparc-sun-solaris2.10/3.4.3/../../../../include/c++/3.4.3/bits/postypes.h:46,
from /usr/sfw/lib/gcc/sparc-sun-solaris2.10/3.4.3/../../../../include/c++/3.4.3/iosfwd:50,
from /usr/sfw/lib/gcc/sparc-sun-solaris2.10/3.4.3/../../../../include/c++/3.4.3/ios:44,
from /usr/sfw/lib/gcc/sparc-sun-solaris2.10/3.4.3/../../../../include/c++/3.4.3/ostream:45,
from /usr/sfw/lib/gcc/sparc-sun-solaris2.10/3.4.3/../../../../include/c++/3.4.3/iostream:45,
from UCArray.h:31,
from TextEl.h:25,
from build.h:29,
from mgpp_passes.cpp:57:
/usr/sfw/lib/gcc/sparc-sun-solaris2.10/3.4.3/../../../../include/c++/3.4.3/cwchar:145: error: `::btowc' has not been declared
/usr/sfw/lib/gcc/sparc-sun-solaris2.10/3.4.3/../../../../include/c++/3.4.3/cwchar:150: error: `::fwide' has not been declared
/usr/sfw/lib/gcc/sparc-sun-solaris2.10/3.4.3/../../../../include/c++/3.4.3/cwchar:151: error: `::fwprintf' has not been declared
/usr/sfw/lib/gcc/sparc-sun-solaris2.10/3.4.3/../../../../include/c++/3.4.3/cwchar:152: error: `::fwscanf' has not been declared
/usr/sfw/lib/gcc/sparc-sun-solaris2.10/3.4.3/../../../../include/c++/3.4.3/cwchar:155: error: `::mbrlen' has not been declared
/usr/sfw/lib/gcc/sparc-sun-solaris2.10/3.4.3/../../../../include/c++/3.4.3/cwchar:156: error: `::mbrtowc' has not been declared
/usr/sfw/lib/gcc/sparc-sun-solaris2.10/3.4.3/../../../../include/c++/3.4.3/cwchar:157: error: `::mbsinit' has not been declared
/usr/sfw/lib/gcc/sparc-sun-solaris2.10/3.4.3/../../../../include/c++/3.4.3/cwchar:158: error: `::mbsrtowcs' has not been declared
/usr/sfw/lib/gcc/sparc-sun-solaris2.10/3.4.3/../../../../include/c++/3.4.3/cwchar:161: error: `::swprintf' has not been declared
/usr/sfw/lib/gcc/sparc-sun-solaris2.10/3.4.3/../../../../include/c++/3.4.3/cwchar:162: error: `::swscanf' has not been declared
/usr/sfw/lib/gcc/sparc-sun-solaris2.10/3.4.3/../../../../include/c++/3.4.3/cwchar:164: error: `::vfwprintf' has not been declared
/usr/sfw/lib/gcc/sparc-sun-solaris2.10/3.4.3/../../../../include/c++/3.4.3/cwchar:168: error: `::vswprintf' has not been declared
/usr/sfw/lib/gcc/sparc-sun-solaris2.10/3.4.3/../../../../include/c++/3.4.3/cwchar:172: error: `::vwprintf' has not been declared
/usr/sfw/lib/gcc/sparc-sun-solaris2.10/3.4.3/../../../../include/c++/3.4.3/cwchar:176: error: `::wcrtomb' has not been declared
/usr/sfw/lib/gcc/sparc-sun-solaris2.10/3.4.3/../../../../include/c++/3.4.3/cwchar:187: error: `::wcsrtombs' has not been declared
/usr/sfw/lib/gcc/sparc-sun-solaris2.10/3.4.3/../../../../include/c++/3.4.3/cwchar:197: error: `::wctob' has not been declared
/usr/sfw/lib/gcc/sparc-sun-solaris2.10/3.4.3/../../../../include/c++/3.4.3/cwchar:198: error: `::wmemcmp' has not been declared
/usr/sfw/lib/gcc/sparc-sun-solaris2.10/3.4.3/../../../../include/c++/3.4.3/cwchar:199: error: `::wmemcpy' has not been declared
/usr/sfw/lib/gcc/sparc-sun-solaris2.10/3.4.3/../../../../include/c++/3.4.3/cwchar:200: error: `::wmemmove' has not been declared
/usr/sfw/lib/gcc/sparc-sun-solaris2.10/3.4.3/../../../../include/c++/3.4.3/cwchar:201: error: `::wmemset' has not been declared
/usr/sfw/lib/gcc/sparc-sun-solaris2.10/3.4.3/../../../../include/c++/3.4.3/cwchar:202: error: `::wprintf' has not been declared
/usr/sfw/lib/gcc/sparc-sun-solaris2.10/3.4.3/../../../../include/c++/3.4.3/cwchar:203: error: `::wscanf' has not been declared
/usr/sfw/lib/gcc/sparc-sun-solaris2.10/3.4.3/../../../../include/c++/3.4.3/cwchar:223: error: `::wcsstr' has not been declared
/usr/sfw/lib/gcc/sparc-sun-solaris2.10/3.4.3/../../../../include/c++/3.4.3/cwchar: In function `wchar_t* std::wcsstr(wchar_t*, const wchar_t*)':
/usr/sfw/lib/gcc/sparc-sun-solaris2.10/3.4.3/../../../../include/c++/3.4.3/cwchar:227: error: invalid conversion from `const wchar_t*' to `wchar_t*'
/usr/sfw/lib/gcc/sparc-sun-solaris2.10/3.4.3/../../../../include/c++/3.4.3/cwchar:227: error: initializing argument 1 of `wchar_t* std::wcsstr(wchar_t*, const wchar_t*)'
/usr/sfw/lib/gcc/sparc-sun-solaris2.10/3.4.3/../../../../include/c++/3.4.3/cwchar: At global scope:
/usr/sfw/lib/gcc/sparc-sun-solaris2.10/3.4.3/../../../../include/c++/3.4.3/cwchar:229: error: `::wmemchr' has not been declared
/usr/sfw/lib/gcc/sparc-sun-solaris2.10/3.4.3/../../../../include/c++/3.4.3/cwchar: In function `wchar_t* std::wmemchr(wchar_t*, wchar_t, size_t)':/usr/sfw/lib/gcc/sparc-sun-solaris2.10/3.4.3/../../../../include/c++/3.4.3/cwchar:233: error: invalid conversion from `const wchar_t*' to `wchar_t*'
/usr/sfw/lib/gcc/sparc-sun-solaris2.10/3.4.3/../../../../include/c++/3.4.3/cwchar:233: error: initializing argument 1 of `wchar_t* std::wmemchr(wchar_t*, wchar_t, size_t)'
In file included from /usr/sfw/lib/gcc/sparc-sun-solaris2.10/3.4.3/../../../../include/c++/3.4.3/ios:46,
from /usr/sfw/lib/gcc/sparc-sun-solaris2.10/3.4.3/../../../../include/c++/3.4.3/ostream:45,
from /usr/sfw/lib/gcc/sparc-sun-solaris2.10/3.4.3/../../../../include/c++/3.4.3/iostream:45,
from UCArray.h:31,
from TextEl.h:25,
from build.h:29,
from mgpp_passes.cpp:57:
/usr/sfw/lib/gcc/sparc-sun-solaris2.10/3.4.3/../../../../include/c++/3.4.3/bits/char_traits.h: In static member function `static int std::char_traits<wchar_t>::compare(const wchar_t*, const wchar_t*, size_t)':
/usr/sfw/lib/gcc/sparc-sun-solaris2.10/3.4.3/../../../../include/c++/3.4.3/bits/char_traits.h:324: error: `wmemcmp' undeclared (first use this function)
/usr/sfw/lib/gcc/sparc-sun-solaris2.10/3.4.3/../../../../include/c++/3.4.3/bits/char_traits.h:324: error: (Each undeclared identifier is reported only once for each function it appears in.)
/usr/sfw/lib/gcc/sparc-sun-solaris2.10/3.4.3/../../../../include/c++/3.4.3/bits/char_traits.h: In static member function `static const wchar_t* std::char_traits<wchar_t>::find(const wchar_t*, size_t, const wchar_t&)':
/usr/sfw/lib/gcc/sparc-sun-solaris2.10/3.4.3/../../../../include/c++/3.4.3/bits/char_traits.h:332: error: invalid conversion from `const wchar_t*' to `wchar_t*'
/usr/sfw/lib/gcc/sparc-sun-solaris2.10/3.4.3/../../../../include/c++/3.4.3/bits/char_traits.h:332: error: initializing argument 1 of `wchar_t* std::wmemchr(wchar_t*, wchar_t, size_t)'
/usr/sfw/lib/gcc/sparc-sun-solaris2.10/3.4.3/../../../../include/c++/3.4.3/bits/char_traits.h: In static member function `static wchar_t* std::char_traits<wchar_t>::move(wchar_t*, const wchar_t*, size_t)':
/usr/sfw/lib/gcc/sparc-sun-solaris2.10/3.4.3/../../../../include/c++/3.4.3/bits/char_traits.h:336: error: `wmemmove' undeclared (first use this function)
/usr/sfw/lib/gcc/sparc-sun-solaris2.10/3.4.3/../../../../include/c++/3.4.3/bits/char_traits.h: In static member function `static wchar_t* std::char_traits<wchar_t>::copy(wchar_t*, const wchar_t*, size_t)':
/usr/sfw/lib/gcc/sparc-sun-solaris2.10/3.4.3/../../../../include/c++/3.4.3/bits/char_traits.h:340: error: `wmemcpy' undeclared (first use this function)
/usr/sfw/lib/gcc/sparc-sun-solaris2.10/3.4.3/../../../../include/c++/3.4.3/bits/char_traits.h: In static member function `static wchar_t* std::char_traits<wchar_t>::assign(wchar_t*, size_t, wchar_t)':
/usr/sfw/lib/gcc/sparc-sun-solaris2.10/3.4.3/../../../../include/c++/3.4.3/bits/char_traits.h:344: error: `wmemset' undeclared (first use this function)
make[2]: *** [mgpp_passes.o] Error 1
make[2]: Leaving directory `/export/home/gsdl/gsdl/src/mgpp/text'
make[1]: *** [all] Error 1
make[1]: Leaving directory `/export/home/gsdl/gsdl/src/mgpp'
make: *** [all] Error 1
sigma:~/gsdl$

Error6

r, or type conversion before "XML_SetCommentHandler"
../../packages/expat/include/expat.h:546: error: expected `,' or `;' before "XML_SetCommentHandler"
../../packages/expat/include/expat.h:550: error: expected constructor, destructor, or type conversion before "XML_SetCdataSectionHandler"
../../packages/expat/include/expat.h:550: error: expected `,' or `;' before "XML_SetCdataSectionHandler"
../../packages/expat/include/expat.h:555: error: expected constructor, destructor, or type conversion before "XML_SetStartCdataSectionHandler"
../../packages/expat/include/expat.h:555: error: expected `,' or `;' before "XML_SetStartCdataSectionHandler"
../../packages/expat/include/expat.h:559: error: expected constructor, destructor, or type conversion before "XML_SetEndCdataSectionHandler"
../../packages/expat/include/expat.h:559: error: expected `,' or `;' before "XML_SetEndCdataSectionHandler"
../../packages/expat/include/expat.h:567: error: expected constructor, destructor, or type conversion before "XML_SetDefaultHandler"
../../packages/expat/include/expat.h:567: error: expected `,' or `;' before "XML_SetDefaultHandler"
../../packages/expat/include/expat.h:575: error: expected constructor, destructor, or type conversion before "XML_SetDefaultHandlerExpand"
../../packages/expat/include/expat.h:575: error: expected `,' or `;' before "XML_SetDefaultHandlerExpand"
../../packages/expat/include/expat.h:579: error: expected constructor, destructor, or type conversion before "XML_SetDoctypeDeclHandler"
../../packages/expat/include/expat.h:579: error: expected `,' or `;' before "XML_SetDoctypeDeclHandler"
../../packages/expat/include/expat.h:584: error: expected constructor, destructor, or type conversion before "XML_SetStartDoctypeDeclHandler"
../../packages/expat/include/expat.h:584: error: expected `,' or `;' before "XML_SetStartDoctypeDeclHandler"
../../packages/expat/include/expat.h:588: error: expected constructor, destructor, or type conversion before "XML_SetEndDoctypeDeclHandler"
../../packages/expat/include/expat.h:588: error: expected `,' or `;' before "XML_SetEndDoctypeDeclHandler"
../../packages/expat/include/expat.h:592: error: expected constructor, destructor, or type conversion before "XML_SetUnparsedEntityDeclHandler"
../../packages/expat/include/expat.h:592: error: expected `,' or `;' before "XML_SetUnparsedEntityDeclHandler"
../../packages/expat/include/expat.h:596: error: expected constructor, destructor, or type conversion before "XML_SetNotationDeclHandler"
../../packages/expat/include/expat.h:596: error: expected `,' or `;' before "XML_SetNotationDeclHandler"
../../packages/expat/include/expat.h:600: error: expected constructor, destructor, or type conversion before "XML_SetNamespaceDeclHandler"
../../packages/expat/include/expat.h:600: error: expected `,' or `;' before "XML_SetNamespaceDeclHandler"
../../packages/expat/include/expat.h:605: error: expected constructor, destructor, or type conversion before "XML_SetStartNamespaceDeclHandler"
../../packages/expat/include/expat.h:605: error: expected `,' or `;' before "XML_SetStartNamespaceDeclHandler"
../../packages/expat/include/expat.h:609: error: expected constructor, destructor, or type conversion before "XML_SetEndNamespaceDeclHandler"
../../packages/expat/include/expat.h:609: error: expected `,' or `;' before "XML_SetEndNamespaceDeclHandler"
../../packages/expat/include/expat.h:613: error: expected constructor, destructor, or type conversion before "XML_SetNotStandaloneHandler"
../../packages/expat/include/expat.h:613: error: expected `,' or `;' before "XML_SetNotStandaloneHandler"
../../packages/expat/include/expat.h:617: error: expected constructor, destructor, or type conversion before "XML_SetExternalEntityRefHandler"
../../packages/expat/include/expat.h:617: error: expected `,' or `;' before "XML_SetExternalEntityRefHandler"
../../packages/expat/include/expat.h:625: error: expected constructor, destructor, or type conversion before "XML_SetExternalEntityRefHandlerArg"
../../packages/expat/include/expat.h:625: error: expected `,' or `;' before "XML_SetExternalEntityRefHandlerArg"
../../packages/expat/include/expat.h:629: error: expected constructor, destructor, or type conversion before "XML_SetSkippedEntityHandler"
../../packages/expat/include/expat.h:629: error: expected `,' or `;' before "XML_SetSkippedEntityHandler"
../../packages/expat/include/expat.h:633: error: expected constructor, destructor, or type conversion before "XML_SetUnknownEncodingHandler"
../../packages/expat/include/expat.h:633: error: expected `,' or `;' before "XML_SetUnknownEncodingHandler"
../../packages/expat/include/expat.h:642: error: expected constructor, destructor, or type conversion before "XML_DefaultCurrent"
../../packages/expat/include/expat.h:642: error: expected `,' or `;' before "XML_DefaultCurrent"
../../packages/expat/include/expat.h:659: error: expected constructor, destructor, or type conversion before "XML_SetReturnNSTriplet"
../../packages/expat/include/expat.h:659: error: expected `,' or `;' before "XML_SetReturnNSTriplet"
../../packages/expat/include/expat.h:663: error: expected constructor, destructor, or type conversion before "XML_SetUserData"
../../packages/expat/include/expat.h:663: error: expected `,' or `;' before "XML_SetUserData"
../../packages/expat/include/expat.h:675: error: expected constructor, destructor, or type conversion before "XML_SetEncoding"
../../packages/expat/include/expat.h:675: error: expected `,' or `;' before "XML_SetEncoding"
../../packages/expat/include/expat.h:682: error: expected constructor, destructor, or type conversion before "XML_UseParserAsHandlerArg"
../../packages/expat/include/expat.h:682: error: expected `,' or `;' before "XML_UseParserAsHandlerArg"
../../packages/expat/include/expat.h:703: error: expected constructor, destructor, or type conversion before "XML_UseForeignDTD"
../../packages/expat/include/expat.h:703: error: expected `,' or `;' before "XML_UseForeignDTD"
../../packages/expat/include/expat.h:715: error: expected constructor, destructor, or type conversion before "XML_SetBase"
../../packages/expat/include/expat.h:715: error: expected `,' or `;' before "XML_SetBase"
../../packages/expat/include/expat.h:717: error: expected `,' or `...' before '*' token
../../packages/expat/include/expat.h:718: error: expected constructor, destructor, or type conversion before "XML_GetBase"
../../packages/expat/include/expat.h:718: error: expected `,' or `;' before "XML_GetBase"
../../packages/expat/include/expat.h:727: error: expected constructor, destructor, or type conversion before "XML_GetSpecifiedAttributeCount"
../../packages/expat/include/expat.h:727: error: expected `,' or `;' before "XML_GetSpecifiedAttributeCount"
../../packages/expat/include/expat.h:735: error: expected constructor, destructor, or type conversion before "XML_GetIdAttributeIndex"
../../packages/expat/include/expat.h:735: error: expected `,' or `;' before "XML_GetIdAttributeIndex"
../../packages/expat/include/expat.h:747: error: expected constructor, destructor, or type conversion before "XML_Parse"
../../packages/expat/include/expat.h:747: error: expected `,' or `;' before "XML_Parse"
../../packages/expat/include/expat.h:750: error: expected constructor, destructor, or type conversion before "XML_GetBuffer"
../../packages/expat/include/expat.h:750: error: expected `,' or `;' before "XML_GetBuffer"
../../packages/expat/include/expat.h:753: error: expected constructor, destructor, or type conversion before "XML_ParseBuffer"
../../packages/expat/include/expat.h:753: error: expected `,' or `;' before "XML_ParseBuffer"
../../packages/expat/include/expat.h:787: error: expected constructor, destructor, or type conversion before "XML_StopParser"
../../packages/expat/include/expat.h:787: error: expected `,' or `;' before "XML_StopParser"
../../packages/expat/include/expat.h:802: error: expected constructor, destructor, or type conversion before "XML_ResumeParser"
../../packages/expat/include/expat.h:802: error: expected `,' or `;' before "XML_ResumeParser"
../../packages/expat/include/expat.h:822: error: expected constructor, destructor, or type conversion before "XML_GetParsingStatus"
../../packages/expat/include/expat.h:822: error: expected `,' or `;' before "XML_GetParsingStatus"
../../packages/expat/include/expat.h:841: error: expected constructor, destructor, or type conversion before "XML_ExternalEntityParserCreate"
../../packages/expat/include/expat.h:841: error: expected `,' or `;' before "XML_ExternalEntityParserCreate"
../../packages/expat/include/expat.h:875: error: expected constructor, destructor, or type conversion before "XML_SetParamEntityParsing"
../../packages/expat/include/expat.h:875: error: expected `,' or `;' before "XML_SetParamEntityParsing"
../../packages/expat/include/expat.h:882: error: expected constructor, destructor, or type conversion before "XML_GetErrorCode"
../../packages/expat/include/expat.h:882: error: expected `,' or `;' before "XML_GetErrorCode"
../../packages/expat/include/expat.h:900: error: expected constructor, destructor, or type conversion before "XML_GetCurrentLineNumber"
../../packages/expat/include/expat.h:900: error: expected `,' or `;' before "XML_GetCurrentLineNumber"
../../packages/expat/include/expat.h:901: error: expected constructor, destructor, or type conversion before "XML_GetCurrentColumnNumber"
../../packages/expat/include/expat.h:901: error: expected `,' or `;' before "XML_GetCurrentColumnNumber"
../../packages/expat/include/expat.h:902: error: expected constructor, destructor, or type conversion before "XML_GetCurrentByteIndex"
../../packages/expat/include/expat.h:902: error: expected `,' or `;' before "XML_GetCurrentByteIndex"
../../packages/expat/include/expat.h:908: error: expected constructor, destructor, or type conversion before "XML_GetCurrentByteCount"
../../packages/expat/include/expat.h:908: error: expected `,' or `;' before "XML_GetCurrentByteCount"
../../packages/expat/include/expat.h:921: error: expected constructor, destructor, or type conversion before "XML_GetInputContext"
../../packages/expat/include/expat.h:921: error: expected `,' or `;' before "XML_GetInputContext"
../../packages/expat/include/expat.h:932: error: expected constructor, destructor, or type conversion before "XML_FreeContentModel"
../../packages/expat/include/expat.h:932: error: expected `,' or `;' before "XML_FreeContentModel"
../../packages/expat/include/expat.h:936: error: expected constructor, destructor, or type conversion before "XML_MemMalloc"
../../packages/expat/include/expat.h:936: error: expected `,' or `;' before "XML_MemMalloc"
../../packages/expat/include/expat.h:939: error: expected constructor, destructor, or type conversion before "XML_MemRealloc"
../../packages/expat/include/expat.h:939: error: expected `,' or `;' before "XML_MemRealloc"
../../packages/expat/include/expat.h:942: error: expected constructor, destructor, or type conversion before "XML_MemFree"
../../packages/expat/include/expat.h:942: error: expected `,' or `;' before "XML_MemFree"
../../packages/expat/include/expat.h:946: error: expected constructor, destructor, or type conversion before "XML_ParserFree"
../../packages/expat/include/expat.h:946: error: expected `,' or `;' before "XML_ParserFree"
../../packages/expat/include/expat.h:949: error: expected `,' or `...' before '*' token
../../packages/expat/include/expat.h:950: error: expected constructor, destructor, or type conversion before "XML_ErrorString"
../../packages/expat/include/expat.h:950: error: expected `,' or `;' before "XML_ErrorString"
../../packages/expat/include/expat.h:953: error: expected `,' or `...' before '*' token
../../packages/expat/include/expat.h:954: error: expected constructor, destructor, or type conversion before "XML_ExpatVersion"
../../packages/expat/include/expat.h:954: error: expected `,' or `;' before "XML_ExpatVersion"
../../packages/expat/include/expat.h:966: error: expected constructor, destructor, or type conversion before "XML_ExpatVersionInfo"
../../packages/expat/include/expat.h:966: error: expected `,' or `;' before "XML_ExpatVersionInfo"
../../packages/expat/include/expat.h:983: error: ISO C++ forbids declaration of `XML_LChar' with no type
../../packages/expat/include/expat.h:983: error: expected `;' before '*' token
../../packages/expat/include/expat.h:988: error: expected constructor, destructor, or type conversion before "XML_GetFeatureList"
../../packages/expat/include/expat.h:988: error: expected `,' or `;' before "XML_GetFeatureList"
../../packages/expat/include/expat.h:1001: error: expected declaration before '}' token
../../packages/expat/include/expat.h:1000:1: unterminated #ifdef
../../packages/expat/include/expat.h:5:1: unterminated #ifndef
make[1]: *** [expat_resultset.o] Error 1
make[1]: Leaving directory `/export/home/gsdl/gsdl/src/colservr'
make: *** [all] Error 1
sigma:~/gsdl$

Error7

ib -I../mgpp/text -I../.. comtypes.cpp
g++ -c -DENABLE_ACCENTFOLD -g -O2 -DNZDL -DQUIET -DSHORT_SUFFIX -DPARADOCNUM -DHAVE_CONFIG_H -I../../lib -I. -I../colservr -I../../packages/mg -I../../packages/mg/lib -I../../packages/mg/src/text -I../../packages/expat/include -I../mgpp/lib -I../mgpp/text -I../.. recptproto.cpp
g++ -c -DENABLE_ACCENTFOLD -g -O2 -DNZDL -DQUIET -DSHORT_SUFFIX -DPARADOCNUM -DHAVE_CONFIG_H -I../../lib -I. -I../colservr -I../../packages/mg -I../../packages/mg/lib -I../../packages/mg/src/text -I../../packages/expat/include -I../mgpp/lib -I../mgpp/text -I../.. pingaction.cpp
g++ -c -DENABLE_ACCENTFOLD -g -O2 -DNZDL -DQUIET -DSHORT_SUFFIX -DPARADOCNUM -DHAVE_CONFIG_H -I../../lib -I. -I../colservr -I../../packages/mg -I../../packages/mg/lib -I../../packages/mg/src/text -I../../packages/expat/include -I../mgpp/lib -I../mgpp/text -I../.. -I/usr/local/include queryaction.cpp
g++ -c -DENABLE_ACCENTFOLD -g -O2 -DNZDL -DQUIET -DSHORT_SUFFIX -DPARADOCNUM -DHAVE_CONFIG_H -I../../lib -I. -I../colservr -I../../packages/mg -I../../packages/mg/lib -I../../packages/mg/src/text -I../../packages/expat/include -I../mgpp/lib -I../mgpp/text -I../.. documentaction.cpp
g++ -c -DENABLE_ACCENTFOLD -g -O2 -DNZDL -DQUIET -DSHORT_SUFFIX -DPARADOCNUM -DHAVE_CONFIG_H -I../../lib -I. -I../colservr -I../../packages/mg -I../../packages/mg/lib -I../../packages/mg/src/text -I../../packages/expat/include -I../mgpp/lib -I../mgpp/text -I../.. extlinkaction.cpp
g++ -c -DENABLE_ACCENTFOLD -g -O2 -DNZDL -DQUIET -DSHORT_SUFFIX -DPARADOCNUM -DHAVE_CONFIG_H -I../../lib -I. -I../colservr -I../../packages/mg -I../../packages/mg/lib -I../../packages/mg/src/text -I../../packages/expat/include -I../mgpp/lib -I../mgpp/text -I../.. browseaction.cpp
g++ -c -DENABLE_ACCENTFOLD -g -O2 -DNZDL -DQUIET -DSHORT_SUFFIX -DPARADOCNUM -DHAVE_CONFIG_H -I../../lib -I. -I../colservr -I../../packages/mg -I../../packages/mg/lib -I../../packages/mg/src/text -I../../packages/expat/include -I../mgpp/lib -I../mgpp/text -I../.. htmlutils.cpp
g++ -c -DENABLE_ACCENTFOLD -g -O2 -DNZDL -DQUIET -DSHORT_SUFFIX -DPARADOCNUM -DHAVE_CONFIG_H -I../../lib -I. -I../colservr -I../../packages/mg -I../../packages/mg/lib -I../../packages/mg/src/text -I../../packages/expat/include -I../mgpp/lib -I../mgpp/text -I../.. querytools.cpp
g++ -c -DENABLE_ACCENTFOLD -g -O2 -DNZDL -DQUIET -DSHORT_SUFFIX -DPARADOCNUM -DHAVE_CONFIG_H -I../../lib -I. -I../colservr -I../../packages/mg -I../../packages/mg/lib -I../../packages/mg/src/text -I../../packages/expat/include -I../mgpp/lib -I../mgpp/text -I../.. browseactiontools.cpp
g++ -c -DENABLE_ACCENTFOLD -g -O2 -DNZDL -DQUIET -DSHORT_SUFFIX -DPARADOCNUM -DHAVE_CONFIG_H -I../../lib -I. -I../colservr -I../../packages/mg -I../../packages/mg/lib -I../../packages/mg/src/text -I../../packages/expat/include -I../mgpp/lib -I../mgpp/text -I../.. formattools.cpp
g++ -c -DENABLE_ACCENTFOLD -g -O2 -DNZDL -DQUIET -DSHORT_SUFFIX -DPARADOCNUM -DHAVE_CONFIG_H -I../../lib -I. -I../colservr -I../../packages/mg -I../../packages/mg/lib -I../../packages/mg/src/text -I../../packages/expat/include -I../mgpp/lib -I../mgpp/text -I../.. tipaction.cpp
g++ -c -DENABLE_ACCENTFOLD -g -O2 -DNZDL -DQUIET -DSHORT_SUFFIX -DPARADOCNUM -DHAVE_CONFIG_H -I../../lib -I. -I../colservr -I../../packages/mg -I../../packages/mg/lib -I../../packages/mg/src/text -I../../packages/expat/include -I../mgpp/lib -I../mgpp/text -I../.. -I/usr/local/include authenaction.cpp
g++ -c -DENABLE_ACCENTFOLD -g -O2 -DNZDL -DQUIET -DSHORT_SUFFIX -DPARADOCNUM -DHAVE_CONFIG_H -I../../lib -I. -I../colservr -I../../packages/mg -I../../packages/mg/lib -I../../packages/mg/src/text -I../../packages/expat/include -I../mgpp/lib -I../mgpp/text -I../.. -I/usr/local/include argdb.cpp
g++ -c -DENABLE_ACCENTFOLD -g -O2 -DNZDL -DQUIET -DSHORT_SUFFIX -DPARADOCNUM -DHAVE_CONFIG_H -I../../lib -I. -I../colservr -I../../packages/mg -I../../packages/mg/lib -I../../packages/mg/src/text -I../../packages/expat/include -I../mgpp/lib -I../mgpp/text -I../.. -I/usr/local/include infodbclass.cpp
g++ -c -DENABLE_ACCENTFOLD -g -O2 -DNZDL -DQUIET -DSHORT_SUFFIX -DPARADOCNUM -DHAVE_CONFIG_H -I../../lib -I. -I../colservr -I../../packages/mg -I../../packages/mg/lib -I../../packages/mg/src/text -I../../packages/expat/include -I../mgpp/lib -I../mgpp/text -I../.. -I/usr/local/include userdb.cpp
g++ -c -DENABLE_ACCENTFOLD -g -O2 -DNZDL -DQUIET -DSHORT_SUFFIX -DPARADOCNUM -DHAVE_CONFIG_H -I../../lib -I. -I../colservr -I../../packages/mg -I../../packages/mg/lib -I../../packages/mg/src/text -I../../packages/expat/include -I../mgpp/lib -I../mgpp/text -I../.. -I/usr/local/include usersaction.cpp
g++ -c -DENABLE_ACCENTFOLD -g -O2 -DNZDL -DQUIET -DSHORT_SUFFIX -DPARADOCNUM -DHAVE_CONFIG_H -I../../lib -I. -I../colservr -I../../packages/mg -I../../packages/mg/lib -I../../packages/mg/src/text -I../../packages/expat/include -I../mgpp/lib -I../mgpp/text -I../.. vlistbrowserclass.cpp
g++ -c -DENABLE_ACCENTFOLD -g -O2 -DNZDL -DQUIET -DSHORT_SUFFIX -DPARADOCNUM -DHAVE_CONFIG_H -I../../lib -I. -I../colservr -I../../packages/mg -I../../packages/mg/lib -I../../packages/mg/src/text -I../../packages/expat/include -I../mgpp/lib -I../mgpp/text -I../.. hlistbrowserclass.cpp
g++ -c -DENABLE_ACCENTFOLD -g -O2 -DNZDL -DQUIET -DSHORT_SUFFIX -DPARADOCNUM -DHAVE_CONFIG_H -I../../lib -I. -I../colservr -I../../packages/mg -I../../packages/mg/lib -I../../packages/mg/src/text -I../../packages/expat/include -I../mgpp/lib -I../mgpp/text -I../.. datelistbrowserclass.cpp
g++ -c -DENABLE_ACCENTFOLD -g -O2 -DNZDL -DQUIET -DSHORT_SUFFIX -DPARADOCNUM -DHAVE_CONFIG_H -I../../lib -I. -I../colservr -I../../packages/mg -I../../packages/mg/lib -I../../packages/mg/src/text -I../../packages/expat/include -I../mgpp/lib -I../mgpp/text -I../.. invbrowserclass.cpp
g++ -c -DENABLE_ACCENTFOLD -g -O2 -DNZDL -DQUIET -DSHORT_SUFFIX -DPARADOCNUM -DHAVE_CONFIG_H -I../../lib -I. -I../colservr -I../../packages/mg -I../../packages/mg/lib -I../../packages/mg/src/text -I../../packages/expat/include -I../mgpp/lib -I../mgpp/text -I../.. pagedbrowserclass.cpp
g++ -c -DENABLE_ACCENTFOLD -g -O2 -DNZDL -DQUIET -DSHORT_SUFFIX -DPARADOCNUM -DHAVE_CONFIG_H -I../../lib -I. -I../colservr -I../../packages/mg -I../../packages/mg/lib -I../../packages/mg/src/text -I../../packages/expat/include -I../mgpp/lib -I../mgpp/text -I../.. htmlbrowserclass.cpp
g++ -c -DENABLE_ACCENTFOLD -g -O2 -DNZDL -DQUIET -DSHORT_SUFFIX -DPARADOCNUM -DHAVE_CONFIG_H -I../../lib -I. -I../colservr -I../../packages/mg -I../../packages/mg/lib -I../../packages/mg/src/text -I../../packages/expat/include -I../mgpp/lib -I../mgpp/text -I../.. phindbrowserclass.cpp
g++ -c -DENABLE_ACCENTFOLD -g -O2 -DNZDL -DQUIET -DSHORT_SUFFIX -DPARADOCNUM -DHAVE_CONFIG_H -I../../lib -I. -I../colservr -I../../packages/mg -I../../packages/mg/lib -I../../packages/mg/src/text -I../../packages/expat/include -I../mgpp/lib -I../mgpp/text -I../.. -I/usr/local/include historydb.cpp
g++ -c -DENABLE_ACCENTFOLD -g -O2 -DNZDL -DQUIET -DSHORT_SUFFIX -DPARADOCNUM -DHAVE_CONFIG_H -I../../lib -I. -I../colservr -I../../packages/mg -I../../packages/mg/lib -I../../packages/mg/src/text -I../../packages/expat/include -I../mgpp/lib -I../mgpp/text -I../.. -I/usr/local/include collectoraction.cpp
collectoraction.cpp:38:1: warning: "_XOPEN_SOURCE" redefined
<built-in>:82:1: warning: this is the location of the previous definitionIn file included from /usr/sfw/lib/gcc/sparc-sun-solaris2.10/3.4.3/../../../../include/c++/3.4.3/bits/postypes.h:46,
from /usr/sfw/lib/gcc/sparc-sun-solaris2.10/3.4.3/../../../../include/c++/3.4.3/iosfwd:50,
from /usr/sfw/lib/gcc/sparc-sun-solaris2.10/3.4.3/../../../../include/c++/3.4.3/bits/stl_algobase.h:70,
from /usr/sfw/lib/gcc/sparc-sun-solaris2.10/3.4.3/../../../../include/c++/3.4.3/vector:67,
from ../../lib/text_t.h:45,
from action.h:31,
from wizardaction.h:31,
from collectoraction.h:32,
from collectoraction.cpp:41:
/usr/sfw/lib/gcc/sparc-sun-solaris2.10/3.4.3/../../../../include/c++/3.4.3/cwchar:145: error: `::btowc' has not been declared
/usr/sfw/lib/gcc/sparc-sun-solaris2.10/3.4.3/../../../../include/c++/3.4.3/cwchar:150: error: `::fwide' has not been declared
/usr/sfw/lib/gcc/sparc-sun-solaris2.10/3.4.3/../../../../include/c++/3.4.3/cwchar:151: error: `::fwprintf' has not been declared
/usr/sfw/lib/gcc/sparc-sun-solaris2.10/3.4.3/../../../../include/c++/3.4.3/cwchar:152: error: `::fwscanf' has not been declared
/usr/sfw/lib/gcc/sparc-sun-solaris2.10/3.4.3/../../../../include/c++/3.4.3/cwchar:155: error: `::mbrlen' has not been declared
/usr/sfw/lib/gcc/sparc-sun-solaris2.10/3.4.3/../../../../include/c++/3.4.3/cwchar:156: error: `::mbrtowc' has not been declared
/usr/sfw/lib/gcc/sparc-sun-solaris2.10/3.4.3/../../../../include/c++/3.4.3/cwchar:157: error: `::mbsinit' has not been declared
/usr/sfw/lib/gcc/sparc-sun-solaris2.10/3.4.3/../../../../include/c++/3.4.3/cwchar:158: error: `::mbsrtowcs' has not been declared
/usr/sfw/lib/gcc/sparc-sun-solaris2.10/3.4.3/../../../../include/c++/3.4.3/cwchar:161: error: `::swprintf' has not been declared
/usr/sfw/lib/gcc/sparc-sun-solaris2.10/3.4.3/../../../../include/c++/3.4.3/cwchar:162: error: `::swscanf' has not been declared
/usr/sfw/lib/gcc/sparc-sun-solaris2.10/3.4.3/../../../../include/c++/3.4.3/cwchar:164: error: `::vfwprintf' has not been declared
/usr/sfw/lib/gcc/sparc-sun-solaris2.10/3.4.3/../../../../include/c++/3.4.3/cwchar:168: error: `::vswprintf' has not been declared
/usr/sfw/lib/gcc/sparc-sun-solaris2.10/3.4.3/../../../../include/c++/3.4.3/cwchar:172: error: `::vwprintf' has not been declared
/usr/sfw/lib/gcc/sparc-sun-solaris2.10/3.4.3/../../../../include/c++/3.4.3/cwchar:176: error: `::wcrtomb' has not been declared
/usr/sfw/lib/gcc/sparc-sun-solaris2.10/3.4.3/../../../../include/c++/3.4.3/cwchar:187: error: `::wcsrtombs' has not been declared
/usr/sfw/lib/gcc/sparc-sun-solaris2.10/3.4.3/../../../../include/c++/3.4.3/cwchar:197: error: `::wctob' has not been declared
/usr/sfw/lib/gcc/sparc-sun-solaris2.10/3.4.3/../../../../include/c++/3.4.3/cwchar:198: error: `::wmemcmp' has not been declared
/usr/sfw/lib/gcc/sparc-sun-solaris2.10/3.4.3/../../../../include/c++/3.4.3/cwchar:199: error: `::wmemcpy' has not been declared
/usr/sfw/lib/gcc/sparc-sun-solaris2.10/3.4.3/../../../../include/c++/3.4.3/cwchar:200: error: `::wmemmove' has not been declared
/usr/sfw/lib/gcc/sparc-sun-solaris2.10/3.4.3/../../../../include/c++/3.4.3/cwchar:201: error: `::wmemset' has not been declared
/usr/sfw/lib/gcc/sparc-sun-solaris2.10/3.4.3/../../../../include/c++/3.4.3/cwchar:202: error: `::wprintf' has not been declared
/usr/sfw/lib/gcc/sparc-sun-solaris2.10/3.4.3/../../../../include/c++/3.4.3/cwchar:203: error: `::wscanf' has not been declared
/usr/sfw/lib/gcc/sparc-sun-solaris2.10/3.4.3/../../../../include/c++/3.4.3/cwchar:223: error: `::wcsstr' has not been declared
/usr/sfw/lib/gcc/sparc-sun-solaris2.10/3.4.3/../../../../include/c++/3.4.3/cwchar: In function `wchar_t* std::wcsstr(wchar_t*, const wchar_t*)':
/usr/sfw/lib/gcc/sparc-sun-solaris2.10/3.4.3/../../../../include/c++/3.4.3/cwchar:227: error: invalid conversion from `const wchar_t*' to `wchar_t*'
/usr/sfw/lib/gcc/sparc-sun-solaris2.10/3.4.3/../../../../include/c++/3.4.3/cwchar:227: error: initializing argument 1 of `wchar_t* std::wcsstr(wchar_t*, const wchar_t*)'
/usr/sfw/lib/gcc/sparc-sun-solaris2.10/3.4.3/../../../../include/c++/3.4.3/cwchar: At global scope:
/usr/sfw/lib/gcc/sparc-sun-solaris2.10/3.4.3/../../../../include/c++/3.4.3/cwchar:229: error: `::wmemchr' has not been declared
/usr/sfw/lib/gcc/sparc-sun-solaris2.10/3.4.3/../../../../include/c++/3.4.3/cwchar: In function `wchar_t* std::wmemchr(wchar_t*, wchar_t, size_t)':/usr/sfw/lib/gcc/sparc-sun-solaris2.10/3.4.3/../../../../include/c++/3.4.3/cwchar:233: error: invalid conversion from `const wchar_t*' to `wchar_t*'
/usr/sfw/lib/gcc/sparc-sun-solaris2.10/3.4.3/../../../../include/c++/3.4.3/cwchar:233: error: initializing argument 1 of `wchar_t* std::wmemchr(wchar_t*, wchar_t, size_t)'
In file included from /usr/sfw/lib/gcc/sparc-sun-solaris2.10/3.4.3/../../../../include/c++/3.4.3/ios:46,
from /usr/sfw/lib/gcc/sparc-sun-solaris2.10/3.4.3/../../../../include/c++/3.4.3/ostream:45,
from ../../lib/text_t.h:324,
from action.h:31,
from wizardaction.h:31,
from collectoraction.h:32,
from collectoraction.cpp:41:
/usr/sfw/lib/gcc/sparc-sun-solaris2.10/3.4.3/../../../../include/c++/3.4.3/bits/char_traits.h: In static member function `static int std::char_traits<wchar_t>::compare(const wchar_t*, const wchar_t*, size_t)':
/usr/sfw/lib/gcc/sparc-sun-solaris2.10/3.4.3/../../../../include/c++/3.4.3/bits/char_traits.h:324: error: `wmemcmp' undeclared (first use this function)
/usr/sfw/lib/gcc/sparc-sun-solaris2.10/3.4.3/../../../../include/c++/3.4.3/bits/char_traits.h:324: error: (Each undeclared identifier is reported only once for each function it appears in.)
/usr/sfw/lib/gcc/sparc-sun-solaris2.10/3.4.3/../../../../include/c++/3.4.3/bits/char_traits.h: In static member function `static const wchar_t* std::char_traits<wchar_t>::find(const wchar_t*, size_t, const wchar_t&)':
/usr/sfw/lib/gcc/sparc-sun-solaris2.10/3.4.3/../../../../include/c++/3.4.3/bits/char_traits.h:332: error: invalid conversion from `const wchar_t*' to `wchar_t*'
/usr/sfw/lib/gcc/sparc-sun-solaris2.10/3.4.3/../../../../include/c++/3.4.3/bits/char_traits.h:332: error: initializing argument 1 of `wchar_t* std::wmemchr(wchar_t*, wchar_t, size_t)'
/usr/sfw/lib/gcc/sparc-sun-solaris2.10/3.4.3/../../../../include/c++/3.4.3/bits/char_traits.h: In static member function `static wchar_t* std::char_traits<wchar_t>::move(wchar_t*, const wchar_t*, size_t)':
/usr/sfw/lib/gcc/sparc-sun-solaris2.10/3.4.3/../../../../include/c++/3.4.3/bits/char_traits.h:336: error: `wmemmove' undeclared (first use this function)
/usr/sfw/lib/gcc/sparc-sun-solaris2.10/3.4.3/../../../../include/c++/3.4.3/bits/char_traits.h: In static member function `static wchar_t* std::char_traits<wchar_t>::copy(wchar_t*, const wchar_t*, size_t)':
/usr/sfw/lib/gcc/sparc-sun-solaris2.10/3.4.3/../../../../include/c++/3.4.3/bits/char_traits.h:340: error: `wmemcpy' undeclared (first use this function)
/usr/sfw/lib/gcc/sparc-sun-solaris2.10/3.4.3/../../../../include/c++/3.4.3/bits/char_traits.h: In static member function `static wchar_t* std::char_traits<wchar_t>::assign(wchar_t*, size_t, wchar_t)':
/usr/sfw/lib/gcc/sparc-sun-solaris2.10/3.4.3/../../../../include/c++/3.4.3/bits/char_traits.h:344: error: `wmemset' undeclared (first use this function)
make[1]: *** [collectoraction.o] Error 1
make[1]: Leaving directory `/export/home/gsdl/gsdl/src/recpt'
make: *** [all] Error 1
sigma:~/gsdl$

Error8

../.././install-sh -c -m 644 zes-update.h /export/home/gsdl/gsdl/packages/yaz/include/yaz/zes-update.h
../.././install-sh -c -m 644 zes-update0.h /export/home/gsdl/gsdl/packages/yaz/include/yaz/zes-update0.h
../.././install-sh -c -m 644 zoom.h /export/home/gsdl/gsdl/packages/yaz/include/yaz/zoom.h
../.././install-sh -c -m 644 z-charneg.h /export/home/gsdl/gsdl/packages/yaz/include/yaz/z-charneg.h
../.././install-sh -c -m 644 charneg.h /export/home/gsdl/gsdl/packages/yaz/include/yaz/charneg.h
../.././install-sh -c -m 644 soap.h /export/home/gsdl/gsdl/packages/yaz/include/yaz/soap.h
../.././install-sh -c -m 644 srw.h /export/home/gsdl/gsdl/packages/yaz/include/yaz/srw.h
../.././install-sh -c -m 644 zgdu.h /export/home/gsdl/gsdl/packages/yaz/include/yaz/zgdu.h
make[4]: Leaving directory `/export/home/gsdl/gsdl/packages/yaz/yaz-2.1.4/include/yaz'
make[3]: Leaving directory `/export/home/gsdl/gsdl/packages/yaz/yaz-2.1.4/include/yaz'
make[3]: Entering directory `/export/home/gsdl/gsdl/packages/yaz/yaz-2.1.4/include'
make[4]: Entering directory `/export/home/gsdl/gsdl/packages/yaz/yaz-2.1.4/include'
make[4]: Nothing to be done for `install-exec-am'.
make[4]: Nothing to be done for `install-data-am'.
make[4]: Leaving directory `/export/home/gsdl/gsdl/packages/yaz/yaz-2.1.4/include'
make[3]: Leaving directory `/export/home/gsdl/gsdl/packages/yaz/yaz-2.1.4/include'
make[2]: Leaving directory `/export/home/gsdl/gsdl/packages/yaz/yaz-2.1.4/include'
cd yaz/yaz-2.1.4/src; make install
make[2]: Entering directory `/export/home/gsdl/gsdl/packages/yaz/yaz-2.1.4/src'
make[3]: Entering directory `/export/home/gsdl/gsdl/packages/yaz/yaz-2.1.4/src'
/bin/bash ../mkinstalldirs /export/home/gsdl/gsdl/packages/yaz/lib
/bin/bash ../libtool --mode=install .././install-sh -c libyaz.la /export/home/gsdl/gsdl/packages/yaz/lib/libyaz.la
.././install-sh -c .libs/libyaz.lai /export/home/gsdl/gsdl/packages/yaz/lib/libyaz.la
.././install-sh -c .libs/libyaz.a /export/home/gsdl/gsdl/packages/yaz/lib/libyaz.a
ranlib /export/home/gsdl/gsdl/packages/yaz/lib/libyaz.a
chmod 644 /export/home/gsdl/gsdl/packages/yaz/lib/libyaz.a
----------------------------------------------------------------------
Libraries have been installed in:
/export/home/gsdl/gsdl/packages/yaz/lib

If you ever happen to want to link against installed libraries
in a given directory, LIBDIR, you must either use libtool, and
specify the full pathname of the library, or use the `-LLIBDIR'
flag during linking and do at least one of the following:
- add LIBDIR to the `LD_LIBRARY_PATH' environment variable
during execution
- use the `-RLIBDIR' linker flag

See any operating system documentation about shared libraries for
more information, such as the ld(1) and ld.so(8) manual pages.
----------------------------------------------------------------------
/bin/bash ../libtool --mode=install .././install-sh -c libyazthread.la /export/home/gsdl/gsdl/packages/yaz/lib/libyazthread.la
.././install-sh -c .libs/libyazthread.lai /export/home/gsdl/gsdl/packages/yaz/lib/libyazthread.la
.././install-sh -c .libs/libyazthread.a /export/home/gsdl/gsdl/packages/yaz/lib/libyazthread.a
ranlib /export/home/gsdl/gsdl/packages/yaz/lib/libyazthread.a
chmod 644 /export/home/gsdl/gsdl/packages/yaz/lib/libyazthread.a
----------------------------------------------------------------------
Libraries have been installed in:
/export/home/gsdl/gsdl/packages/yaz/lib

If you ever happen to want to link against installed libraries
in a given directory, LIBDIR, you must either use libtool, and
specify the full pathname of the library, or use the `-LLIBDIR'
flag during linking and do at least one of the following:
- add LIBDIR to the `LD_LIBRARY_PATH' environment variable
during execution
- use the `-RLIBDIR' linker flag

See any operating system documentation about shared libraries for
more information, such as the ld(1) and ld.so(8) manual pages.
----------------------------------------------------------------------
/bin/bash ../mkinstalldirs /export/home/gsdl/gsdl/packages/yaz/share/yaz/ill
.././install-sh -c -m 644 ./ill9702.asn /export/home/gsdl/gsdl/packages/yaz/share/yaz/ill/ill9702.asn
.././install-sh -c -m 644 ./item-req.asn /export/home/gsdl/gsdl/packages/yaz/share/yaz/ill/item-req.asn
.././install-sh -c -m 644 ./ill.tcl /export/home/gsdl/gsdl/packages/yaz/share/yaz/ill/ill.tcl
/bin/bash ../mkinstalldirs /export/home/gsdl/gsdl/packages/yaz/share/yaz/z39.50
.././install-sh -c -m 644 ./datetime.asn /export/home/gsdl/gsdl/packages/yaz/share/yaz/z39.50/datetime.asn
.././install-sh -c -m 644 ./esupdate.asn /export/home/gsdl/gsdl/packages/yaz/share/yaz/z39.50/esupdate.asn
.././install-sh -c -m 644 ./univres.asn /export/home/gsdl/gsdl/packages/yaz/share/yaz/z39.50/univres.asn
.././install-sh -c -m 644 ./z3950v3.asn /export/home/gsdl/gsdl/packages/yaz/share/yaz/z39.50/z3950v3.asn
.././install-sh -c -m 644 ./z.tcl /export/home/gsdl/gsdl/packages/yaz/share/yaz/z39.50/z.tcl
.././install-sh -c -m 644 ./esadmin.asn /export/home/gsdl/gsdl/packages/yaz/share/yaz/z39.50/esadmin.asn
.././install-sh -c -m 644 ./charneg-3.asn /export/home/gsdl/gsdl/packages/yaz/share/yaz/z39.50/charneg-3.asn
.././install-sh -c -m 644 ./mterm2.asn /export/home/gsdl/gsdl/packages/yaz/share/yaz/z39.50/mterm2.asn
.././install-sh -c -m 644 ./oclcui.asn /export/home/gsdl/gsdl/packages/yaz/share/yaz/z39.50/oclcui.asn
make[3]: Leaving directory `/export/home/gsdl/gsdl/packages/yaz/yaz-2.1.4/src'
make[2]: Leaving directory `/export/home/gsdl/gsdl/packages/yaz/yaz-2.1.4/src'
make[1]: Leaving directory `/export/home/gsdl/gsdl/packages'
making all in packages/mg
make[1]: Entering directory `/export/home/gsdl/gsdl/packages/mg'
for subdir in lib src/text; do
echo making all in $subdir;
(cd $subdir && make all) || exit 1;
done
making all in lib
make[2]: Entering directory `/export/home/gsdl/gsdl/packages/mg/lib'
make[2]: Nothing to be done for `all'.
make[2]: Leaving directory `/export/home/gsdl/gsdl/packages/mg/lib'
making all in src/text
make[2]: Entering directory `/export/home/gsdl/gsdl/packages/mg/src/text'make[2]: Nothing to be done for `all'.
make[2]: Leaving directory `/export/home/gsdl/gsdl/packages/mg/src/text'
make[1]: Leaving directory `/export/home/gsdl/gsdl/packages/mg'
making all in lib
make[1]: Entering directory `/export/home/gsdl/gsdl/lib'
make[1]: Nothing to be done for `all'.
make[1]: Leaving directory `/export/home/gsdl/gsdl/lib'
making all in src/mgpp
make[1]: Entering directory `/export/home/gsdl/gsdl/src/mgpp'
for subdir in lib text; do
echo making all in $subdir;
(cd $subdir && make all) || exit 1;
done
making all in lib
make[2]: Entering directory `/export/home/gsdl/gsdl/src/mgpp/lib'
make[2]: Nothing to be done for `all'.
make[2]: Leaving directory `/export/home/gsdl/gsdl/src/mgpp/lib'
making all in text
make[2]: Entering directory `/export/home/gsdl/gsdl/src/mgpp/text'
make[2]: Nothing to be done for `all'.
make[2]: Leaving directory `/export/home/gsdl/gsdl/src/mgpp/text'
make[1]: Leaving directory `/export/home/gsdl/gsdl/src/mgpp'
making all in src/colservr
make[1]: Entering directory `/export/home/gsdl/gsdl/src/colservr'
make USE_MGPP=1 mgppsearch.o mgppqueryfilter.o
make[2]: Entering directory `/export/home/gsdl/gsdl/src/colservr'
make[2]: `mgppsearch.o' is up to date.
make[2]: `mgppqueryfilter.o' is up to date.
make[2]: Leaving directory `/export/home/gsdl/gsdl/src/colservr'
make[1]: Leaving directory `/export/home/gsdl/gsdl/src/colservr'
making all in src/recpt
make[1]: Entering directory `/export/home/gsdl/gsdl/src/recpt'
g++ -c -DENABLE_ACCENTFOLD -g -O2 -DNZDL -DQUIET -DSHORT_SUFFIX -DPARADOCNUM -DHAVE_CONFIG_H -I../../lib -I. -I../colservr -I../../packages/mg -I../../packages/mg/lib -I../../packages/mg/src/text -I../../packages/expat/include -I../mgpp/lib -I../mgpp/text -I../.. -I/usr/local/include depositoraction.cpp
depositoraction.cpp:39:1: warning: "_XOPEN_SOURCE" redefined
<built-in>:82:1: warning: this is the location of the previous definitionmake[1]: Warning: File `wizardaction.cpp' has modification time 37 s in the future
g++ -c -DENABLE_ACCENTFOLD -g -O2 -DNZDL -DQUIET -DSHORT_SUFFIX -DPARADOCNUM -DHAVE_CONFIG_H -I../../lib -I. -I../colservr -I../../packages/mg -I../../packages/mg/lib -I../../packages/mg/src/text -I../../packages/expat/include -I../mgpp/lib -I../mgpp/text -I../.. -I/usr/local/include wizardaction.cpp
wizardaction.cpp:38:1: warning: "_XOPEN_SOURCE" redefined
<built-in>:82:1: warning: this is the location of the previous definitiong++ -c -DENABLE_ACCENTFOLD -g -O2 -DNZDL -DQUIET -DSHORT_SUFFIX -DPARADOCNUM -DHAVE_CONFIG_H -I../../lib -I. -I../colservr -I../../packages/mg -I../../packages/mg/lib -I../../packages/mg/src/text -I../../packages/expat/include -I../mgpp/lib -I../mgpp/text -I../.. phindaction.cpp
g++ -c -DENABLE_ACCENTFOLD -g -O2 -DNZDL -DQUIET -DSHORT_SUFFIX -DPARADOCNUM -DHAVE_CONFIG_H -I../../lib -I. -I../colservr -I../../packages/mg -I../../packages/mg/lib -I../../packages/mg/src/text -I../../packages/expat/include -I../mgpp/lib -I../mgpp/text -I../.. summarise.cpp
g++ -c -DENABLE_ACCENTFOLD -g -O2 -DNZDL -DQUIET -DSHORT_SUFFIX -DPARADOCNUM -DHAVE_CONFIG_H -I../../lib -I. -I../colservr -I../../packages/mg -I../../packages/mg/lib -I../../packages/mg/src/text -I../../packages/expat/include -I../mgpp/lib -I../mgpp/text -I../.. highlighttext.cpp
g++ -c -DENABLE_ACCENTFOLD -g -O2 -DNZDL -DQUIET -DSHORT_SUFFIX -DPARADOCNUM -DHAVE_CONFIG_H -I../../lib -I. -I../colservr -I../../packages/mg -I../../packages/mg/lib -I../../packages/mg/src/text -I../../packages/expat/include -I../mgpp/lib -I../mgpp/text -I../.. gtiaction.cpp
g++ -c -DENABLE_ACCENTFOLD -g -O2 -DNZDL -DQUIET -DSHORT_SUFFIX -DPARADOCNUM -DHAVE_CONFIG_H -I../../lib -I. -I../colservr -I../../packages/mg -I../../packages/mg/lib -I../../packages/mg/src/text -I../../packages/expat/include -I../mgpp/lib -I../mgpp/text -I../.. -I/usr/local/include nullproto.cpp
g++ -c -DENABLE_ACCENTFOLD -g -O2 -DNZDL -DQUIET -DSHORT_SUFFIX -DPARADOCNUM -DHAVE_CONFIG_H -I../../lib -I. -I../colservr -I../../packages/mg -I../../packages/mg/lib -I../../packages/mg/src/text -I../../packages/expat/include -I../mgpp/lib -I../mgpp/text -I../.. -I/usr/local/include librarymain.cpp
g++ -o library receptionist.o cgiwrapper.o cgiargs.o action.o browserclass.o converter.o recptconfig.o cgiutils.o OIDtools.o browsetoolsclass.o statusaction.o pageaction.o comtypes.o recptproto.o pingaction.o queryaction.o documentaction.o extlinkaction.o browseaction.o htmlutils.o querytools.o browseactiontools.o formattools.o tipaction.o authenaction.o argdb.o infodbclass.o userdb.o usersaction.o vlistbrowserclass.o hlistbrowserclass.o datelistbrowserclass.o invbrowserclass.o pagedbrowserclass.o htmlbrowserclass.o phindbrowserclass.o historydb.o collectoraction.o depositoraction.o wizardaction.o phindaction.o summarise.o highlighttext.o gtiaction.o nullproto.o librarymain.o ../colservr/mgq.o ../colservr/search.o ../colservr/mgsearch.o ../colservr/querycache.o ../colservr/queryinfo.o ../colservr/collectserver.o ../colservr/colservrconfig.o ../colservr/maptools.o ../colservr/filter.o ../colservr/source.o ../colservr/browsefilter.o ../colservr/queryfilter.o ../colservr/gdbmsource.o ../colservr/mggdbmsource.o ../colservr/phrasesearch.o ../colservr/phrasequeryfilter.o ../colservr/mgqueryfilter.o ../colservr/mgppsearch.o ../colservr/mgppqueryfilter.o ../colservr/collectset.o ../colservr/lucenesearch.o ../colservr/lucenequeryfilter.o ../colservr/lucenegdbmsource.o ../colservr/expat_resultset.o ../colservr/expat_document.o ../../lib/gsdllib.a ../../packages/mg/src/text/libtextin.a ../../packages/mg/lib/libmg.a ../mgpp/text/libtextin.a ../mgpp/lib/libmg.a -L/usr/local/lib -lgdbm -L../../packages/expat/lib -lexpat ../../packages/unac/libunac.a -lcrypt -lm
Undefined first referenced
symbol in file
libiconv_close ../../packages/unac/libunac.a(unac.o)libiconv_open ../../packages/unac/libunac.a(unac.o)libiconv ../../packages/unac/libunac.a(unac.o)ld: fatal: Symbol referencing errors. No output written to library
collect2: ld returned 1 exit status
make[1]: *** [library] Error 1
make[1]: Leaving directory `/export/home/gsdl/gsdl/src/recpt'
make: *** [all] Error 1
sigma:~/gsdl$

ERROR9

.././install-sh -c -m 644 ./esupdate.asn /export/home/gsdl/gsdl/packages/yaz/share/yaz/z39.50/esupdate.asn
.././install-sh -c -m 644 ./univres.asn /export/home/gsdl/gsdl/packages/yaz/share/yaz/z39.50/univres.asn
.././install-sh -c -m 644 ./z3950v3.asn /export/home/gsdl/gsdl/packages/yaz/share/yaz/z39.50/z3950v3.asn
.././install-sh -c -m 644 ./z.tcl /export/home/gsdl/gsdl/packages/yaz/share/yaz/z39.50/z.tcl
.././install-sh -c -m 644 ./esadmin.asn /export/home/gsdl/gsdl/packages/yaz/share/yaz/z39.50/esadmin.asn
.././install-sh -c -m 644 ./charneg-3.asn /export/home/gsdl/gsdl/packages/yaz/share/yaz/z39.50/charneg-3.asn
.././install-sh -c -m 644 ./mterm2.asn /export/home/gsdl/gsdl/packages/yaz/share/yaz/z39.50/mterm2.asn
.././install-sh -c -m 644 ./oclcui.asn /export/home/gsdl/gsdl/packages/yaz/share/yaz/z39.50/oclcui.asn
make[3]: Leaving directory `/export/home/gsdl/gsdl/packages/yaz/yaz-2.1.4/src'
make[2]: Leaving directory `/export/home/gsdl/gsdl/packages/yaz/yaz-2.1.4/src'
make[1]: Leaving directory `/export/home/gsdl/gsdl/packages'
making all in packages/mg
make[1]: Entering directory `/export/home/gsdl/gsdl/packages/mg'
for subdir in lib src/text; do
echo making all in $subdir;
(cd $subdir && make all) || exit 1;
done
making all in lib
make[2]: Entering directory `/export/home/gsdl/gsdl/packages/mg/lib'
make[2]: Nothing to be done for `all'.
make[2]: Leaving directory `/export/home/gsdl/gsdl/packages/mg/lib'
making all in src/text
make[2]: Entering directory `/export/home/gsdl/gsdl/packages/mg/src/text'make[2]: Nothing to be done for `all'.
make[2]: Leaving directory `/export/home/gsdl/gsdl/packages/mg/src/text'
make[1]: Leaving directory `/export/home/gsdl/gsdl/packages/mg'
making all in lib
make[1]: Entering directory `/export/home/gsdl/gsdl/lib'
make[1]: Nothing to be done for `all'.
make[1]: Leaving directory `/export/home/gsdl/gsdl/lib'
making all in src/mgpp
make[1]: Entering directory `/export/home/gsdl/gsdl/src/mgpp'
for subdir in lib text; do
echo making all in $subdir;
(cd $subdir && make all) || exit 1;
done
making all in lib
make[2]: Entering directory `/export/home/gsdl/gsdl/src/mgpp/lib'
make[2]: Nothing to be done for `all'.
make[2]: Leaving directory `/export/home/gsdl/gsdl/src/mgpp/lib'
making all in text
make[2]: Entering directory `/export/home/gsdl/gsdl/src/mgpp/text'
make[2]: Nothing to be done for `all'.
make[2]: Leaving directory `/export/home/gsdl/gsdl/src/mgpp/text'
make[1]: Leaving directory `/export/home/gsdl/gsdl/src/mgpp'
making all in src/colservr
make[1]: Entering directory `/export/home/gsdl/gsdl/src/colservr'
make USE_MGPP=1 mgppsearch.o mgppqueryfilter.o
make[2]: Entering directory `/export/home/gsdl/gsdl/src/colservr'
make[2]: `mgppsearch.o' is up to date.
make[2]: `mgppqueryfilter.o' is up to date.
make[2]: Leaving directory `/export/home/gsdl/gsdl/src/colservr'
make[1]: Leaving directory `/export/home/gsdl/gsdl/src/colservr'
making all in src/recpt
make[1]: Entering directory `/export/home/gsdl/gsdl/src/recpt'
make[1]: Warning: File `Makefile' has modification time 55 s in the future
g++ -o library receptionist.o cgiwrapper.o cgiargs.o action.o browserclass.o converter.o recptconfig.o cgiutils.o OIDtools.o browsetoolsclass.o statusaction.o pageaction.o comtypes.o recptproto.o pingaction.o queryaction.o documentaction.o extlinkaction.o browseaction.o htmlutils.o querytools.o browseactiontools.o formattools.o tipaction.o authenaction.o argdb.o infodbclass.o userdb.o usersaction.o vlistbrowserclass.o hlistbrowserclass.o datelistbrowserclass.o invbrowserclass.o pagedbrowserclass.o htmlbrowserclass.o phindbrowserclass.o historydb.o collectoraction.o depositoraction.o wizardaction.o phindaction.o summarise.o highlighttext.o gtiaction.o nullproto.o librarymain.o ../colservr/mgq.o ../colservr/search.o ../colservr/mgsearch.o ../colservr/querycache.o ../colservr/queryinfo.o ../colservr/collectserver.o ../colservr/colservrconfig.o ../colservr/maptools.o ../colservr/filter.o ../colservr/source.o ../colservr/browsefilter.o ../colservr/queryfilter.o ../colservr/gdbmsource.o ../colservr/mggdbmsource.o ../colservr/phrasesearch.o ../colservr/phrasequeryfilter.o ../colservr/mgqueryfilter.o ../colservr/mgppsearch.o ../colservr/mgppqueryfilter.o ../colservr/collectset.o ../colservr/lucenesearch.o ../colservr/lucenequeryfilter.o ../colservr/lucenegdbmsource.o ../colservr/expat_resultset.o ../colservr/expat_document.o ../../lib/gsdllib.a ../../packages/mg/src/text/libtextin.a ../../packages/mg/lib/libmg.a ../mgpp/text/libtextin.a ../mgpp/lib/libmg.a -L/usr/local/lib -lgdbm -L../../packages/expat/lib -lexpat ../../packages/unac/libunac.a -lcrypt -lm -liconv
make[1]: warning: Clock skew detected. Your build may be incomplete.
make[1]: Leaving directory `/export/home/gsdl/gsdl/src/recpt'
making all in src/txt2db
make[1]: Entering directory `/export/home/gsdl/gsdl/src/txt2db'
g++ -c -DHAVE_CONFIG_H -I../../lib -I/usr/local/include -Wall -O2 txt2db.cpp
g++ -o txt2db txt2db.o ../../lib/gsdllib.a ../../packages/mg/lib/unitool.o -L/usr/local/lib -lgdbm -lcrypt -lm
make[1]: Leaving directory `/export/home/gsdl/gsdl/src/txt2db'
making all in src/db2txt
make[1]: Entering directory `/export/home/gsdl/gsdl/src/db2txt'
g++ -c -DHAVE_CONFIG_H -I../../lib -I/usr/local/include -Wall -O2 db2txt.cpp
g++ -o db2txt db2txt.o -L/usr/local/lib -lgdbm -lcrypt -lm
make[1]: Leaving directory `/export/home/gsdl/gsdl/src/db2txt'
making all in src/hashfile
make[1]: Entering directory `/export/home/gsdl/gsdl/src/hashfile'
g++ -c -DHAVE_CONFIG_H -I../../lib hashfile.cpp
g++ -o hashfile hashfile.o ../../lib/gsdllib.a
make[1]: Leaving directory `/export/home/gsdl/gsdl/src/hashfile'
making all in src/getpw
make[1]: Entering directory `/export/home/gsdl/gsdl/src/getpw'
g++ -c -DHAVE_CONFIG_H -I../.. -I../../lib -g -O2 getpw.cpp
getpw.cpp:26:1: warning: "_XOPEN_SOURCE" redefined
<built-in>:82:1: warning: this is the location of the previous definitionIn file included from /usr/sfw/lib/gcc/sparc-sun-solaris2.10/3.4.3/../../../../include/c++/3.4.3/bits/postypes.h:46,
from /usr/sfw/lib/gcc/sparc-sun-solaris2.10/3.4.3/../../../../include/c++/3.4.3/iosfwd:50,
from /usr/sfw/lib/gcc/sparc-sun-solaris2.10/3.4.3/../../../../include/c++/3.4.3/ios:44,
from /usr/sfw/lib/gcc/sparc-sun-solaris2.10/3.4.3/../../../../include/c++/3.4.3/ostream:45,
from /usr/sfw/lib/gcc/sparc-sun-solaris2.10/3.4.3/../../../../include/c++/3.4.3/iostream:45,
from getpw.cpp:65:
/usr/sfw/lib/gcc/sparc-sun-solaris2.10/3.4.3/../../../../include/c++/3.4.3/cwchar:145: error: `::btowc' has not been declared
/usr/sfw/lib/gcc/sparc-sun-solaris2.10/3.4.3/../../../../include/c++/3.4.3/cwchar:150: error: `::fwide' has not been declared
/usr/sfw/lib/gcc/sparc-sun-solaris2.10/3.4.3/../../../../include/c++/3.4.3/cwchar:151: error: `::fwprintf' has not been declared
/usr/sfw/lib/gcc/sparc-sun-solaris2.10/3.4.3/../../../../include/c++/3.4.3/cwchar:152: error: `::fwscanf' has not been declared
/usr/sfw/lib/gcc/sparc-sun-solaris2.10/3.4.3/../../../../include/c++/3.4.3/cwchar:155: error: `::mbrlen' has not been declared
/usr/sfw/lib/gcc/sparc-sun-solaris2.10/3.4.3/../../../../include/c++/3.4.3/cwchar:156: error: `::mbrtowc' has not been declared
/usr/sfw/lib/gcc/sparc-sun-solaris2.10/3.4.3/../../../../include/c++/3.4.3/cwchar:157: error: `::mbsinit' has not been declared
/usr/sfw/lib/gcc/sparc-sun-solaris2.10/3.4.3/../../../../include/c++/3.4.3/cwchar:158: error: `::mbsrtowcs' has not been declared
/usr/sfw/lib/gcc/sparc-sun-solaris2.10/3.4.3/../../../../include/c++/3.4.3/cwchar:161: error: `::swprintf' has not been declared
/usr/sfw/lib/gcc/sparc-sun-solaris2.10/3.4.3/../../../../include/c++/3.4.3/cwchar:162: error: `::swscanf' has not been declared
/usr/sfw/lib/gcc/sparc-sun-solaris2.10/3.4.3/../../../../include/c++/3.4.3/cwchar:164: error: `::vfwprintf' has not been declared
/usr/sfw/lib/gcc/sparc-sun-solaris2.10/3.4.3/../../../../include/c++/3.4.3/cwchar:168: error: `::vswprintf' has not been declared
/usr/sfw/lib/gcc/sparc-sun-solaris2.10/3.4.3/../../../../include/c++/3.4.3/cwchar:172: error: `::vwprintf' has not been declared
/usr/sfw/lib/gcc/sparc-sun-solaris2.10/3.4.3/../../../../include/c++/3.4.3/cwchar:176: error: `::wcrtomb' has not been declared
/usr/sfw/lib/gcc/sparc-sun-solaris2.10/3.4.3/../../../../include/c++/3.4.3/cwchar:187: error: `::wcsrtombs' has not been declared
/usr/sfw/lib/gcc/sparc-sun-solaris2.10/3.4.3/../../../../include/c++/3.4.3/cwchar:197: error: `::wctob' has not been declared
/usr/sfw/lib/gcc/sparc-sun-solaris2.10/3.4.3/../../../../include/c++/3.4.3/cwchar:198: error: `::wmemcmp' has not been declared
/usr/sfw/lib/gcc/sparc-sun-solaris2.10/3.4.3/../../../../include/c++/3.4.3/cwchar:199: error: `::wmemcpy' has not been declared
/usr/sfw/lib/gcc/sparc-sun-solaris2.10/3.4.3/../../../../include/c++/3.4.3/cwchar:200: error: `::wmemmove' has not been declared
/usr/sfw/lib/gcc/sparc-sun-solaris2.10/3.4.3/../../../../include/c++/3.4.3/cwchar:201: error: `::wmemset' has not been declared
/usr/sfw/lib/gcc/sparc-sun-solaris2.10/3.4.3/../../../../include/c++/3.4.3/cwchar:202: error: `::wprintf' has not been declared
/usr/sfw/lib/gcc/sparc-sun-solaris2.10/3.4.3/../../../../include/c++/3.4.3/cwchar:203: error: `::wscanf' has not been declared
/usr/sfw/lib/gcc/sparc-sun-solaris2.10/3.4.3/../../../../include/c++/3.4.3/cwchar:223: error: `::wcsstr' has not been declared
/usr/sfw/lib/gcc/sparc-sun-solaris2.10/3.4.3/../../../../include/c++/3.4.3/cwchar: In function `wchar_t* std::wcsstr(wchar_t*, const wchar_t*)':
/usr/sfw/lib/gcc/sparc-sun-solaris2.10/3.4.3/../../../../include/c++/3.4.3/cwchar:227: error: invalid conversion from `const wchar_t*' to `wchar_t*'
/usr/sfw/lib/gcc/sparc-sun-solaris2.10/3.4.3/../../../../include/c++/3.4.3/cwchar:227: error: initializing argument 1 of `wchar_t* std::wcsstr(wchar_t*, const wchar_t*)'
/usr/sfw/lib/gcc/sparc-sun-solaris2.10/3.4.3/../../../../include/c++/3.4.3/cwchar: At global scope:
/usr/sfw/lib/gcc/sparc-sun-solaris2.10/3.4.3/../../../../include/c++/3.4.3/cwchar:229: error: `::wmemchr' has not been declared
/usr/sfw/lib/gcc/sparc-sun-solaris2.10/3.4.3/../../../../include/c++/3.4.3/cwchar: In function `wchar_t* std::wmemchr(wchar_t*, wchar_t, size_t)':/usr/sfw/lib/gcc/sparc-sun-solaris2.10/3.4.3/../../../../include/c++/3.4.3/cwchar:233: error: invalid conversion from `const wchar_t*' to `wchar_t*'
/usr/sfw/lib/gcc/sparc-sun-solaris2.10/3.4.3/../../../../include/c++/3.4.3/cwchar:233: error: initializing argument 1 of `wchar_t* std::wmemchr(wchar_t*, wchar_t, size_t)'
In file included from /usr/sfw/lib/gcc/sparc-sun-solaris2.10/3.4.3/../../../../include/c++/3.4.3/ios:46,
from /usr/sfw/lib/gcc/sparc-sun-solaris2.10/3.4.3/../../../../include/c++/3.4.3/ostream:45,
from /usr/sfw/lib/gcc/sparc-sun-solaris2.10/3.4.3/../../../../include/c++/3.4.3/iostream:45,
from getpw.cpp:65:
/usr/sfw/lib/gcc/sparc-sun-solaris2.10/3.4.3/../../../../include/c++/3.4.3/bits/char_traits.h: In static member function `static int std::char_traits<wchar_t>::compare(const wchar_t*, const wchar_t*, size_t)':
/usr/sfw/lib/gcc/sparc-sun-solaris2.10/3.4.3/../../../../include/c++/3.4.3/bits/char_traits.h:324: error: `wmemcmp' undeclared (first use this function)
/usr/sfw/lib/gcc/sparc-sun-solaris2.10/3.4.3/../../../../include/c++/3.4.3/bits/char_traits.h:324: error: (Each undeclared identifier is reported only once for each function it appears in.)
/usr/sfw/lib/gcc/sparc-sun-solaris2.10/3.4.3/../../../../include/c++/3.4.3/bits/char_traits.h: In static member function `static const wchar_t* std::char_traits<wchar_t>::find(const wchar_t*, size_t, const wchar_t&)':
/usr/sfw/lib/gcc/sparc-sun-solaris2.10/3.4.3/../../../../include/c++/3.4.3/bits/char_traits.h:332: error: invalid conversion from `const wchar_t*' to `wchar_t*'
/usr/sfw/lib/gcc/sparc-sun-solaris2.10/3.4.3/../../../../include/c++/3.4.3/bits/char_traits.h:332: error: initializing argument 1 of `wchar_t* std::wmemchr(wchar_t*, wchar_t, size_t)'
/usr/sfw/lib/gcc/sparc-sun-solaris2.10/3.4.3/../../../../include/c++/3.4.3/bits/char_traits.h: In static member function `static wchar_t* std::char_traits<wchar_t>::move(wchar_t*, const wchar_t*, size_t)':
/usr/sfw/lib/gcc/sparc-sun-solaris2.10/3.4.3/../../../../include/c++/3.4.3/bits/char_traits.h:336: error: `wmemmove' undeclared (first use this function)
/usr/sfw/lib/gcc/sparc-sun-solaris2.10/3.4.3/../../../../include/c++/3.4.3/bits/char_traits.h: In static member function `static wchar_t* std::char_traits<wchar_t>::copy(wchar_t*, const wchar_t*, size_t)':
/usr/sfw/lib/gcc/sparc-sun-solaris2.10/3.4.3/../../../../include/c++/3.4.3/bits/char_traits.h:340: error: `wmemcpy' undeclared (first use this function)
/usr/sfw/lib/gcc/sparc-sun-solaris2.10/3.4.3/../../../../include/c++/3.4.3/bits/char_traits.h: In static member function `static wchar_t* std::char_traits<wchar_t>::assign(wchar_t*, size_t, wchar_t)':
/usr/sfw/lib/gcc/sparc-sun-solaris2.10/3.4.3/../../../../include/c++/3.4.3/bits/char_traits.h:344: error: `wmemset' undeclared (first use this function)
make[1]: *** [getpw.o] Error 1
make[1]: Leaving directory `/export/home/gsdl/gsdl/src/getpw'
make: *** [all] Error 1
sigma:~/gsdl$

Error10

Libraries have been installed in:
/export/home/gsdl/gsdl/packages/yaz/lib

If you ever happen to want to link against installed libraries
in a given directory, LIBDIR, you must either use libtool, and
specify the full pathname of the library, or use the `-LLIBDIR'
flag during linking and do at least one of the following:
- add LIBDIR to the `LD_LIBRARY_PATH' environment variable
during execution
- use the `-RLIBDIR' linker flag

See any operating system documentation about shared libraries for
more information, such as the ld(1) and ld.so(8) manual pages.
----------------------------------------------------------------------
/bin/bash ../libtool --mode=install .././install-sh -c libyazthread.la /export/home/gsdl/gsdl/packages/yaz/lib/libyazthread.la
.././install-sh -c .libs/libyazthread.lai /export/home/gsdl/gsdl/packages/yaz/lib/libyazthread.la
.././install-sh -c .libs/libyazthread.a /export/home/gsdl/gsdl/packages/yaz/lib/libyazthread.a
ranlib /export/home/gsdl/gsdl/packages/yaz/lib/libyazthread.a
chmod 644 /export/home/gsdl/gsdl/packages/yaz/lib/libyazthread.a
----------------------------------------------------------------------
Libraries have been installed in:
/export/home/gsdl/gsdl/packages/yaz/lib

If you ever happen to want to link against installed libraries
in a given directory, LIBDIR, you must either use libtool, and
specify the full pathname of the library, or use the `-LLIBDIR'
flag during linking and do at least one of the following:
- add LIBDIR to the `LD_LIBRARY_PATH' environment variable
during execution
- use the `-RLIBDIR' linker flag

See any operating system documentation about shared libraries for
more information, such as the ld(1) and ld.so(8) manual pages.
----------------------------------------------------------------------
/bin/bash ../mkinstalldirs /export/home/gsdl/gsdl/packages/yaz/share/yaz/ill
.././install-sh -c -m 644 ./ill9702.asn /export/home/gsdl/gsdl/packages/yaz/share/yaz/ill/ill9702.asn
.././install-sh -c -m 644 ./item-req.asn /export/home/gsdl/gsdl/packages/yaz/share/yaz/ill/item-req.asn
.././install-sh -c -m 644 ./ill.tcl /export/home/gsdl/gsdl/packages/yaz/share/yaz/ill/ill.tcl
/bin/bash ../mkinstalldirs /export/home/gsdl/gsdl/packages/yaz/share/yaz/z39.50
.././install-sh -c -m 644 ./datetime.asn /export/home/gsdl/gsdl/packages/yaz/share/yaz/z39.50/datetime.asn
.././install-sh -c -m 644 ./esupdate.asn /export/home/gsdl/gsdl/packages/yaz/share/yaz/z39.50/esupdate.asn
.././install-sh -c -m 644 ./univres.asn /export/home/gsdl/gsdl/packages/yaz/share/yaz/z39.50/univres.asn
.././install-sh -c -m 644 ./z3950v3.asn /export/home/gsdl/gsdl/packages/yaz/share/yaz/z39.50/z3950v3.asn
.././install-sh -c -m 644 ./z.tcl /export/home/gsdl/gsdl/packages/yaz/share/yaz/z39.50/z.tcl
.././install-sh -c -m 644 ./esadmin.asn /export/home/gsdl/gsdl/packages/yaz/share/yaz/z39.50/esadmin.asn
.././install-sh -c -m 644 ./charneg-3.asn /export/home/gsdl/gsdl/packages/yaz/share/yaz/z39.50/charneg-3.asn
.././install-sh -c -m 644 ./mterm2.asn /export/home/gsdl/gsdl/packages/yaz/share/yaz/z39.50/mterm2.asn
.././install-sh -c -m 644 ./oclcui.asn /export/home/gsdl/gsdl/packages/yaz/share/yaz/z39.50/oclcui.asn
make[3]: Leaving directory `/export/home/gsdl/gsdl/packages/yaz/yaz-2.1.4/src'
make[2]: Leaving directory `/export/home/gsdl/gsdl/packages/yaz/yaz-2.1.4/src'
make[1]: Leaving directory `/export/home/gsdl/gsdl/packages'
making all in packages/mg
make[1]: Entering directory `/export/home/gsdl/gsdl/packages/mg'
for subdir in lib src/text; do
echo making all in $subdir;
(cd $subdir && make all) || exit 1;
done
making all in lib
make[2]: Entering directory `/export/home/gsdl/gsdl/packages/mg/lib'
make[2]: Nothing to be done for `all'.
make[2]: Leaving directory `/export/home/gsdl/gsdl/packages/mg/lib'
making all in src/text
make[2]: Entering directory `/export/home/gsdl/gsdl/packages/mg/src/text'make[2]: Nothing to be done for `all'.
make[2]: Leaving directory `/export/home/gsdl/gsdl/packages/mg/src/text'
make[1]: Leaving directory `/export/home/gsdl/gsdl/packages/mg'
making all in lib
make[1]: Entering directory `/export/home/gsdl/gsdl/lib'
make[1]: Nothing to be done for `all'.
make[1]: Leaving directory `/export/home/gsdl/gsdl/lib'
making all in src/mgpp
make[1]: Entering directory `/export/home/gsdl/gsdl/src/mgpp'
for subdir in lib text; do
echo making all in $subdir;
(cd $subdir && make all) || exit 1;
done
making all in lib
make[2]: Entering directory `/export/home/gsdl/gsdl/src/mgpp/lib'
make[2]: Nothing to be done for `all'.
make[2]: Leaving directory `/export/home/gsdl/gsdl/src/mgpp/lib'
making all in text
make[2]: Entering directory `/export/home/gsdl/gsdl/src/mgpp/text'
make[2]: Nothing to be done for `all'.
make[2]: Leaving directory `/export/home/gsdl/gsdl/src/mgpp/text'
make[1]: Leaving directory `/export/home/gsdl/gsdl/src/mgpp'
making all in src/colservr
make[1]: Entering directory `/export/home/gsdl/gsdl/src/colservr'
make USE_MGPP=1 mgppsearch.o mgppqueryfilter.o
make[2]: Entering directory `/export/home/gsdl/gsdl/src/colservr'
make[2]: `mgppsearch.o' is up to date.
make[2]: `mgppqueryfilter.o' is up to date.
make[2]: Leaving directory `/export/home/gsdl/gsdl/src/colservr'
make[1]: Leaving directory `/export/home/gsdl/gsdl/src/colservr'
making all in src/recpt
make[1]: Entering directory `/export/home/gsdl/gsdl/src/recpt'
make[1]: Nothing to be done for `all'.
make[1]: Leaving directory `/export/home/gsdl/gsdl/src/recpt'
making all in src/txt2db
make[1]: Entering directory `/export/home/gsdl/gsdl/src/txt2db'
make[1]: Nothing to be done for `all'.
make[1]: Leaving directory `/export/home/gsdl/gsdl/src/txt2db'
making all in src/db2txt
make[1]: Entering directory `/export/home/gsdl/gsdl/src/db2txt'
make[1]: Nothing to be done for `all'.
make[1]: Leaving directory `/export/home/gsdl/gsdl/src/db2txt'
making all in src/hashfile
make[1]: Entering directory `/export/home/gsdl/gsdl/src/hashfile'
make[1]: Nothing to be done for `all'.
make[1]: Leaving directory `/export/home/gsdl/gsdl/src/hashfile'
making all in src/getpw
make[1]: Entering directory `/export/home/gsdl/gsdl/src/getpw'
make[1]: Warning: File `getpw.cpp' has modification time 49 s in the future
g++ -c -DHAVE_CONFIG_H -I../.. -I../../lib -g -O2 getpw.cpp
getpw.cpp:27:1: warning: "_XOPEN_SOURCE" redefined
<built-in>:82:1: warning: this is the location of the previous definitiong++ -o getpw getpw.o -lcrypt -lm
make[1]: warning: Clock skew detected. Your build may be incomplete.
make[1]: Leaving directory `/export/home/gsdl/gsdl/src/getpw'
making all in src/phind/generate
make[1]: Entering directory `/export/home/gsdl/gsdl/src/phind/generate'
g++ -c -DHAVE_CONFIG_H -g -O2 phrase.cpp
g++ -c -DHAVE_CONFIG_H -g -O2 suffix.cpp
g++ -o suffix phrase.o suffix.o
make[1]: Leaving directory `/export/home/gsdl/gsdl/src/phind/generate'
making all in src/oaiservr
make[1]: Entering directory `/export/home/gsdl/gsdl/src/oaiservr'
g++ -c -DENABLE_ACCENTFOLD -g -O2 -I./../../lib -I./../../src/colservr -I./../../src/mgpp/lib -I./../../src/mgpp/text -I./../../src/recpt -o oaiargs.o oaiargs.cpp
g++ -c -DENABLE_ACCENTFOLD -g -O2 -I./../../lib -I./../../src/colservr -I./../../src/mgpp/lib -I./../../src/mgpp/text -I./../../src/recpt -o oaiaction.o oaiaction.cpp
g++ -c -DENABLE_ACCENTFOLD -g -O2 -I./../../lib -I./../../src/colservr -I./../../src/mgpp/lib -I./../../src/mgpp/text -I./../../src/recpt -o oaiconfig.o oaiconfig.cpp
g++ -c -DENABLE_ACCENTFOLD -g -O2 -I./../../lib -I./../../src/colservr -I./../../src/mgpp/lib -I./../../src/mgpp/text -I./../../src/recpt -o oaidispatcher.o oaidispatcher.cpp
g++ -c -DENABLE_ACCENTFOLD -g -O2 -I./../../lib -I./../../src/colservr -I./../../src/mgpp/lib -I./../../src/mgpp/text -I./../../src/recpt -o identityaction.o identityaction.cpp
g++ -c -DENABLE_ACCENTFOLD -g -O2 -I./../../lib -I./../../src/colservr -I./../../src/mgpp/lib -I./../../src/mgpp/text -I./../../src/recpt -o recordaction.o recordaction.cpp
g++ -c -DENABLE_ACCENTFOLD -g -O2 -I./../../lib -I./../../src/colservr -I./../../src/mgpp/lib -I./../../src/mgpp/text -I./../../src/recpt -o abstractlistaction.o abstractlistaction.cpp
g++ -c -DENABLE_ACCENTFOLD -g -O2 -I./../../lib -I./../../src/colservr -I./../../src/mgpp/lib -I./../../src/mgpp/text -I./../../src/recpt -o listrecsaction.o listrecsaction.cpp
g++ -c -DENABLE_ACCENTFOLD -g -O2 -I./../../lib -I./../../src/colservr -I./../../src/mgpp/lib -I./../../src/mgpp/text -I./../../src/recpt -o listidsaction.o listidsaction.cpp
g++ -c -DENABLE_ACCENTFOLD -g -O2 -I./../../lib -I./../../src/colservr -I./../../src/mgpp/lib -I./../../src/mgpp/text -I./../../src/recpt -o listsetsaction.o listsetsaction.cpp
g++ -c -DENABLE_ACCENTFOLD -g -O2 -I./../../lib -I./../../src/colservr -I./../../src/mgpp/lib -I./../../src/mgpp/text -I./../../src/recpt -o metaformatsaction.o metaformatsaction.cpp
g++ -c -DENABLE_ACCENTFOLD -g -O2 -I./../../lib -I./../../src/colservr -I./../../src/mgpp/lib -I./../../src/mgpp/text -I./../../src/recpt -o oaitools.o oaitools.cpp
g++ -c -DENABLE_ACCENTFOLD -g -O2 -I./../../lib -I./../../src/colservr -I./../../src/mgpp/lib -I./../../src/mgpp/text -I./../../src/recpt -o metaformat.o metaformat.cpp
g++ -c -DENABLE_ACCENTFOLD -g -O2 -I./../../lib -I./../../src/colservr -I./../../src/mgpp/lib -I./../../src/mgpp/text -I./../../src/recpt -o dublincore.o dublincore.cpp
g++ -c -DENABLE_ACCENTFOLD -g -O2 -I./../../lib -I./../../src/colservr -I./../../src/mgpp/lib -I./../../src/mgpp/text -I./../../src/recpt -o rfc1807.o rfc1807.cpp
g++ -c -DENABLE_ACCENTFOLD -g -O2 -I./../../lib -I./../../src/colservr -I./../../src/mgpp/lib -I./../../src/mgpp/text -I./../../src/recpt -o resumptiontoken.o resumptiontoken.cpp
g++ -c -DENABLE_ACCENTFOLD -g -O2 -I./../../lib -I./../../src/colservr -I./../../src/mgpp/lib -I./../../src/mgpp/text -I./../../src/recpt -o oaimain.o oaimain.cpp
g++ -o oaiserver oaiargs.o oaiaction.o oaiconfig.o oaidispatcher.o identityaction.o recordaction.o abstractlistaction.o listrecsaction.o listidsaction.o listsetsaction.o metaformatsaction.o oaitools.o metaformat.o dublincore.o rfc1807.o resumptiontoken.o ../../src/recpt/comtypes.o ../../src/recpt/OIDtools.o ../../src/recpt/nullproto.o ../../src/recpt/recptproto.o ../../src/recpt/htmlutils.o ../../src/recpt/infodbclass.o ../../src/recpt/recptconfig.o ../../src/recpt/cgiargs.o ../../src/recpt/cgiutils.o oaimain.o ../../src/colservr/mgq.o ../../src/colservr/search.o ../../src/colservr/mgsearch.o ../../src/colservr/querycache.o ../../src/colservr/queryinfo.o ../../src/colservr/collectserver.o ../../src/colservr/colservrconfig.o ../../src/colservr/maptools.o ../../src/colservr/filter.o ../../src/colservr/source.o ../../src/colservr/browsefilter.o ../../src/colservr/queryfilter.o ../../src/colservr/gdbmsource.o ../../src/colservr/mggdbmsource.o ../../src/colservr/phrasesearch.o ../../src/colservr/phrasequeryfilter.o ../../src/colservr/mgqueryfilter.o ../../src/colservr/mgppsearch.o ../../src/colservr/mgppqueryfilter.o ../../src/colservr/collectset.o ../../src/colservr/lucenesearch.o ../../src/colservr/lucenequeryfilter.o ../../src/colservr/lucenegdbmsource.o ../../src/colservr/expat_resultset.o ../../src/colservr/expat_document.o ../../lib/gsdllib.a ../../packages/mg/src/text/libtextin.a ../../packages/mg/lib/libmg.a ../../src/mgpp/text/libtextin.a ../../src/mgpp/lib/libmg.a -L/usr/local/lib -lgdbm ../../packages/unac/libunac.a -lcrypt -lm -L../../packages/expat/lib -lexpat
Undefined first referenced
symbol in file
libiconv_close ../../packages/unac/libunac.a(unac.o)libiconv_open ../../packages/unac/libunac.a(unac.o)libiconv ../../packages/unac/libunac.a(unac.o)ld: fatal: Symbol referencing errors. No output written to oaiserver
collect2: ld returned 1 exit status
make[1]: *** [oaiserver] Error 1
make[1]: Leaving directory `/export/home/gsdl/gsdl/src/oaiservr'
make: *** [all] Error 1