[greenstone-users] Having difficulties to build form the source code in Ubuntu 10.04

From Biligsaikhan B.
DateTue Jun 15 10:33:33 2010
Subject [greenstone-users] Having difficulties to build form the source code in Ubuntu 10.04
In-Reply-To (4C030D0A-3060002-cs-waikato-ac-nz)
Dear Katherine and the list,

I am having problems to build GSDLv2.82 from the source code on Ubuntu
Lycid(10.04) with the latest updates e.g, g++, gcc 4.4.3.

Errors are: mg_files.cpp:56: error: invalid conversion from ?const
char*? to ?char*?

I have tried in CentOS with gcc 3.4.6 20060404 (Red Hat 3.4.6-11).

Error is: "STL Broken - Obtain newer version of GNU C Compiler"

Could you recommend latest the configuration(is it gcc 2.9.5?) that I
can build without problem?

Your advices are valuable.

Biligsaikhan
-------------- next part --------------
This file contains any messages produced by compilers while
running configure, to aid debugging if configure makes a mistake.

It was created by configure, which was
generated by GNU Autoconf 2.59. Invocation command line was

$ ./configure --enable-z3950

## --------- ##
## Platform. ##
## --------- ##

hostname = x200
uname -m = x86_64
uname -r = 2.6.32-22-generic
uname -s = Linux
uname -v = #33-Ubuntu SMP Wed Apr 28 13:28:05 UTC 2010

/usr/bin/uname -p = unknown
/bin/uname -X = unknown

/bin/arch = unknown
/usr/bin/arch -k = unknown
/usr/convex/getsysinfo = unknown
hostinfo = unknown
/bin/machine = unknown
/usr/bin/oslevel = unknown
/bin/universe = unknown

PATH: /usr/local/sbin
PATH: /usr/local/bin
PATH: /usr/sbin
PATH: /usr/bin
PATH: /sbin
PATH: /bin
PATH: /usr/X11R6/bin


## ----------- ##
## Core tests. ##
## ----------- ##

configure:1650: checking for gcc
configure:1666: found /usr/bin/gcc
configure:1676: result: gcc
configure:1920: checking for C compiler version
configure:1923: gcc --version </dev/null >&5
gcc (Ubuntu 4.4.3-4ubuntu5) 4.4.3
Copyright (C) 2009 Free Software Foundation, Inc.
This is free software; see the source for copying conditions. There is NO
warranty; not even for MERCHANTABILITY or FITNESS FOR A PARTICULAR PURPOSE.

configure:1926: $? = 0
configure:1928: gcc -v </dev/null >&5
Using built-in specs.
Target: x86_64-linux-gnu
Configured with: ../src/configure -v --with-pkgversion='Ubuntu 4.4.3-4ubuntu5' --with-bugurl=file:///usr/share/doc/gcc-4.4/README.Bugs --enable-languages=c,c++,fortran,objc,obj-c++ --prefix=/usr --enable-shared --enable-multiarch --enable-linker-build-id --with-system-zlib --libexecdir=/usr/lib --without-included-gettext --enable-threads=posix --with-gxx-include-dir=/usr/include/c++/4.4 --program-suffix=-4.4 --enable-nls --enable-clocale=gnu --enable-libstdcxx-debug --enable-plugin --enable-objc-gc --disable-werror --with-arch-32=i486 --with-tune=generic --enable-checking=release --build=x86_64-linux-gnu --host=x86_64-linux-gnu --target=x86_64-linux-gnu
Thread model: posix
gcc version 4.4.3 (Ubuntu 4.4.3-4ubuntu5)
configure:1931: $? = 0
configure:1933: gcc -V </dev/null >&5
gcc: '-V' option must have argument
configure:1936: $? = 1
configure:1959: checking for C compiler default output file name
configure:1962: gcc -O2 conftest.c >&5
configure:1965: $? = 0
configure:2011: result: a.out
configure:2016: checking whether the C compiler works
configure:2022: ./a.out
configure:2025: $? = 0
configure:2042: result: yes
configure:2049: checking whether we are cross compiling
configure:2051: result: no
configure:2054: checking for suffix of executables
configure:2056: gcc -o conftest -O2 conftest.c >&5
configure:2059: $? = 0
configure:2084: result:
configure:2090: checking for suffix of object files
configure:2111: gcc -c -O2 conftest.c >&5
configure:2114: $? = 0
configure:2136: result: o
configure:2140: checking whether we are using the GNU C compiler
configure:2164: gcc -c -O2 conftest.c >&5
configure:2170: $? = 0
configure:2174: test -z
|| test ! -s conftest.err
configure:2177: $? = 0
configure:2180: test -s conftest.o
configure:2183: $? = 0
configure:2196: result: yes
configure:2202: checking whether gcc accepts -g
configure:2223: gcc -c -g conftest.c >&5
configure:2229: $? = 0
configure:2233: test -z
|| test ! -s conftest.err
configure:2236: $? = 0
configure:2239: test -s conftest.o
configure:2242: $? = 0
configure:2253: result: yes
configure:2270: checking for gcc option to accept ANSI C
configure:2340: gcc -c -O2 conftest.c >&5
configure:2346: $? = 0
configure:2350: test -z
|| test ! -s conftest.err
configure:2353: $? = 0
configure:2356: test -s conftest.o
configure:2359: $? = 0
configure:2377: result: none needed
configure:2395: gcc -c -O2 conftest.c >&5
conftest.c:2: error: expected '=', ',', ';', 'asm' or '__attribute__' before 'me'
configure:2401: $? = 1
configure: failed program was:
| #ifndef __cplusplus
| choke me
| #endif
configure:2586: checking for g++
configure:2602: found /usr/bin/g++
configure:2612: result: g++
configure:2628: checking for C++ compiler version
configure:2631: g++ --version </dev/null >&5
g++ (Ubuntu 4.4.3-4ubuntu5) 4.4.3
Copyright (C) 2009 Free Software Foundation, Inc.
This is free software; see the source for copying conditions. There is NO
warranty; not even for MERCHANTABILITY or FITNESS FOR A PARTICULAR PURPOSE.

configure:2634: $? = 0
configure:2636: g++ -v </dev/null >&5
Using built-in specs.
Target: x86_64-linux-gnu
Configured with: ../src/configure -v --with-pkgversion='Ubuntu 4.4.3-4ubuntu5' --with-bugurl=file:///usr/share/doc/gcc-4.4/README.Bugs --enable-languages=c,c++,fortran,objc,obj-c++ --prefix=/usr --enable-shared --enable-multiarch --enable-linker-build-id --with-system-zlib --libexecdir=/usr/lib --without-included-gettext --enable-threads=posix --with-gxx-include-dir=/usr/include/c++/4.4 --program-suffix=-4.4 --enable-nls --enable-clocale=gnu --enable-libstdcxx-debug --enable-plugin --enable-objc-gc --disable-werror --with-arch-32=i486 --with-tune=generic --enable-checking=release --build=x86_64-linux-gnu --host=x86_64-linux-gnu --target=x86_64-linux-gnu
Thread model: posix
gcc version 4.4.3 (Ubuntu 4.4.3-4ubuntu5)
configure:2639: $? = 0
configure:2641: g++ -V </dev/null >&5
g++: '-V' option must have argument
configure:2644: $? = 1
configure:2647: checking whether we are using the GNU C++ compiler
configure:2671: g++ -c conftest.cc >&5
configure:2677: $? = 0
configure:2681: test -z
|| test ! -s conftest.err
configure:2684: $? = 0
configure:2687: test -s conftest.o
configure:2690: $? = 0
configure:2703: result: yes
configure:2709: checking whether g++ accepts -g
configure:2730: g++ -c -g conftest.cc >&5
configure:2736: $? = 0
configure:2740: test -z
|| test ! -s conftest.err
configure:2743: $? = 0
configure:2746: test -s conftest.o
configure:2749: $? = 0
configure:2760: result: yes
configure:2802: g++ -c -g -O2 conftest.cc >&5
configure:2808: $? = 0
configure:2812: test -z
|| test ! -s conftest.err
configure:2815: $? = 0
configure:2818: test -s conftest.o
configure:2821: $? = 0
configure:2847: g++ -c -g -O2 conftest.cc >&5
conftest.cc: In function 'int main()':
conftest.cc:25: error: 'exit' was not declared in this scope
configure:2853: $? = 1
configure: failed program was:
| /* confdefs.h. */
|
| #define PACKAGE_NAME ""
| #define PACKAGE_TARNAME ""
| #define PACKAGE_VERSION ""
| #define PACKAGE_STRING ""
| #define PACKAGE_BUGREPORT ""
| #define PACKAGE "gsdl"
| #define VERSION "2.82-svn"
| #define MICO_DIR "default"
| #define USE_Z3950
| #define USE_YAZ
| #define USE_JDBM
| #define USE_GDBM
| #define ENABLE_ACCENTFOLD
| #define USE_SQLITE
| #define ENABLE_MG
| #define ENABLE_MGPP
| #define ENABLE_LUCENE
| /* end confdefs.h. */
|
| int
| main ()
| {
| exit (42);
| ;
| return 0;
| }
configure:2802: g++ -c -g -O2 conftest.cc >&5
conftest.cc:21: error: 'void std::exit(int)' should have been declared inside 'std'
configure:2808: $? = 1
configure: failed program was:
| /* confdefs.h. */
|
| #define PACKAGE_NAME ""
| #define PACKAGE_TARNAME ""
| #define PACKAGE_VERSION ""
| #define PACKAGE_STRING ""
| #define PACKAGE_BUGREPORT ""
| #define PACKAGE "gsdl"
| #define VERSION "2.82-svn"
| #define MICO_DIR "default"
| #define USE_Z3950
| #define USE_YAZ
| #define USE_JDBM
| #define USE_GDBM
| #define ENABLE_ACCENTFOLD
| #define USE_SQLITE
| #define ENABLE_MG
| #define ENABLE_MGPP
| #define ENABLE_LUCENE
| /* end confdefs.h. */
| extern "C" void std::exit (int) throw (); using std::exit;
| #include <stdlib.h>
| int
| main ()
| {
| exit (42);
| ;
| return 0;
| }
configure:2802: g++ -c -g -O2 conftest.cc >&5
conftest.cc:21: error: 'void std::exit(int)' should have been declared inside 'std'
In file included from conftest.cc:22:
/usr/include/stdlib.h:543: error: declaration of 'void std::exit(int) throw ()' throws different exceptions
conftest.cc:21: error: from previous declaration 'void std::exit(int)'
configure:2808: $? = 1
configure: failed program was:
| /* confdefs.h. */
|
| #define PACKAGE_NAME ""
| #define PACKAGE_TARNAME ""
| #define PACKAGE_VERSION ""
| #define PACKAGE_STRING ""
| #define PACKAGE_BUGREPORT ""
| #define PACKAGE "gsdl"
| #define VERSION "2.82-svn"
| #define MICO_DIR "default"
| #define USE_Z3950
| #define USE_YAZ
| #define USE_JDBM
| #define USE_GDBM
| #define ENABLE_ACCENTFOLD
| #define USE_SQLITE
| #define ENABLE_MG
| #define ENABLE_MGPP
| #define ENABLE_LUCENE
| /* end confdefs.h. */
| extern "C" void std::exit (int); using std::exit;
| #include <stdlib.h>
| int
| main ()
| {
| exit (42);
| ;
| return 0;
| }
configure:2802: g++ -c -g -O2 conftest.cc >&5
configure:2808: $? = 0
configure:2812: test -z
|| test ! -s conftest.err
configure:2815: $? = 0
configure:2818: test -s conftest.o
configure:2821: $? = 0
configure:2847: g++ -c -g -O2 conftest.cc >&5
configure:2853: $? = 0
configure:2857: test -z
|| test ! -s conftest.err
configure:2860: $? = 0
configure:2863: test -s conftest.o
configure:2866: $? = 0
configure:2893: checking for gawk
configure:2909: found /usr/bin/gawk
configure:2919: result: gawk
configure:2933: checking for bison
configure:2962: result: no
configure:2933: checking for byacc
configure:2962: result: no
configure:3001: checking build system type
configure:3019: result: x86_64-unknown-linux-gnu
configure:3027: checking host system type
configure:3041: result: x86_64-unknown-linux-gnu
configure:3049: checking target system type
configure:3063: result: x86_64-unknown-linux-gnu
configure:3090: checking for a BSD-compatible install
configure:3145: result: /usr/bin/install -c
configure:3156: checking whether ln -s works
configure:3160: result: yes
configure:3167: checking whether make sets $(MAKE)
configure:3187: result: yes
configure:3237: checking for ranlib
configure:3253: found /usr/bin/ranlib
configure:3264: result: ranlib
configure:3277: checking to see if architecture is 64-bit
configure:3285: result: yes
configure:3349: checking how to run the C preprocessor
configure:3384: gcc -E conftest.c
configure:3390: $? = 0
configure:3422: gcc -E conftest.c
conftest.c:24:28: error: ac_nonexistent.h: No such file or directory
configure:3428: $? = 1
configure: failed program was:
| /* confdefs.h. */
|
| #define PACKAGE_NAME ""
| #define PACKAGE_TARNAME ""
| #define PACKAGE_VERSION ""
| #define PACKAGE_STRING ""
| #define PACKAGE_BUGREPORT ""
| #define PACKAGE "gsdl"
| #define VERSION "2.82-svn"
| #define MICO_DIR "default"
| #define USE_Z3950
| #define USE_YAZ
| #define USE_JDBM
| #define USE_GDBM
| #define ENABLE_ACCENTFOLD
| #define USE_SQLITE
| #define ENABLE_MG
| #define ENABLE_MGPP
| #define ENABLE_LUCENE
| #ifdef __cplusplus
| extern "C" void exit (int) throw ();
| #endif
| /* end confdefs.h. */
| #include <ac_nonexistent.h>
configure:3467: result: gcc -E
configure:3491: gcc -E conftest.c
configure:3497: $? = 0
configure:3529: gcc -E conftest.c
conftest.c:24:28: error: ac_nonexistent.h: No such file or directory
configure:3535: $? = 1
configure: failed program was:
| /* confdefs.h. */
|
| #define PACKAGE_NAME ""
| #define PACKAGE_TARNAME ""
| #define PACKAGE_VERSION ""
| #define PACKAGE_STRING ""
| #define PACKAGE_BUGREPORT ""
| #define PACKAGE "gsdl"
| #define VERSION "2.82-svn"
| #define MICO_DIR "default"
| #define USE_Z3950
| #define USE_YAZ
| #define USE_JDBM
| #define USE_GDBM
| #define ENABLE_ACCENTFOLD
| #define USE_SQLITE
| #define ENABLE_MG
| #define ENABLE_MGPP
| #define ENABLE_LUCENE
| #ifdef __cplusplus
| extern "C" void exit (int) throw ();
| #endif
| /* end confdefs.h. */
| #include <ac_nonexistent.h>
configure:3579: checking for egrep
configure:3589: result: grep -E
configure:3595: checking for AIX
configure:3617: result: no
configure:3623: checking for library containing strerror
configure:3653: gcc -o conftest -O2 conftest.c >&5
configure:3659: $? = 0
configure:3663: test -z
|| test ! -s conftest.err
configure:3666: $? = 0
configure:3669: test -s conftest
configure:3672: $? = 0
configure:3742: result: none required
configure:3749: checking for ANSI C header files
configure:3774: gcc -c -O2 conftest.c >&5
configure:3780: $? = 0
configure:3784: test -z
|| test ! -s conftest.err
configure:3787: $? = 0
configure:3790: test -s conftest.o
configure:3793: $? = 0
configure:3882: gcc -o conftest -O2 conftest.c >&5
conftest.c: In function 'main':
conftest.c:41: warning: incompatible implicit declaration of built-in function 'exit'
configure:3885: $? = 0
configure:3887: ./conftest
configure:3890: $? = 0
configure:3905: result: yes
configure:3929: checking for sys/types.h
configure:3945: gcc -c -O2 conftest.c >&5
configure:3951: $? = 0
configure:3955: test -z
|| test ! -s conftest.err
configure:3958: $? = 0
configure:3961: test -s conftest.o
configure:3964: $? = 0
configure:3975: result: yes
configure:3929: checking for sys/stat.h
configure:3945: gcc -c -O2 conftest.c >&5
configure:3951: $? = 0
configure:3955: test -z
|| test ! -s conftest.err
configure:3958: $? = 0
configure:3961: test -s conftest.o
configure:3964: $? = 0
configure:3975: result: yes
configure:3929: checking for stdlib.h
configure:3945: gcc -c -O2 conftest.c >&5
configure:3951: $? = 0
configure:3955: test -z
|| test ! -s conftest.err
configure:3958: $? = 0
configure:3961: test -s conftest.o
configure:3964: $? = 0
configure:3975: result: yes
configure:3929: checking for string.h
configure:3945: gcc -c -O2 conftest.c >&5
configure:3951: $? = 0
configure:3955: test -z
|| test ! -s conftest.err
configure:3958: $? = 0
configure:3961: test -s conftest.o
configure:3964: $? = 0
configure:3975: result: yes
configure:3929: checking for memory.h
configure:3945: gcc -c -O2 conftest.c >&5
configure:3951: $? = 0
configure:3955: test -z
|| test ! -s conftest.err
configure:3958: $? = 0
configure:3961: test -s conftest.o
configure:3964: $? = 0
configure:3975: result: yes
configure:3929: checking for strings.h
configure:3945: gcc -c -O2 conftest.c >&5
configure:3951: $? = 0
configure:3955: test -z
|| test ! -s conftest.err
configure:3958: $? = 0
configure:3961: test -s conftest.o
configure:3964: $? = 0
configure:3975: result: yes
configure:3929: checking for inttypes.h
configure:3945: gcc -c -O2 conftest.c >&5
configure:3951: $? = 0
configure:3955: test -z
|| test ! -s conftest.err
configure:3958: $? = 0
configure:3961: test -s conftest.o
configure:3964: $? = 0
configure:3975: result: yes
configure:3929: checking for stdint.h
configure:3945: gcc -c -O2 conftest.c >&5
configure:3951: $? = 0
configure:3955: test -z
|| test ! -s conftest.err
configure:3958: $? = 0
configure:3961: test -s conftest.o
configure:3964: $? = 0
configure:3975: result: yes
configure:3929: checking for unistd.h
configure:3945: gcc -c -O2 conftest.c >&5
configure:3951: $? = 0
configure:3955: test -z
|| test ! -s conftest.err
configure:3958: $? = 0
configure:3961: test -s conftest.o
configure:3964: $? = 0
configure:3975: result: yes
configure:3997: checking minix/config.h usability
configure:4009: gcc -c -O2 conftest.c >&5
conftest.c:68:26: error: minix/config.h: No such file or directory
configure:4015: $? = 1
configure: failed program was:
| /* confdefs.h. */
|
| #define PACKAGE_NAME ""
| #define PACKAGE_TARNAME ""
| #define PACKAGE_VERSION ""
| #define PACKAGE_STRING ""
| #define PACKAGE_BUGREPORT ""
| #define PACKAGE "gsdl"
| #define VERSION "2.82-svn"
| #define MICO_DIR "default"
| #define USE_Z3950
| #define USE_YAZ
| #define USE_JDBM
| #define USE_GDBM
| #define ENABLE_ACCENTFOLD
| #define USE_SQLITE
| #define ENABLE_MG
| #define ENABLE_MGPP
| #define ENABLE_LUCENE
| #ifdef __cplusplus
| extern "C" void exit (int) throw ();
| #endif
| #define STDC_HEADERS 1
| #define HAVE_SYS_TYPES_H 1
| #define HAVE_SYS_STAT_H 1
| #define HAVE_STDLIB_H 1
| #define HAVE_STRING_H 1
| #define HAVE_MEMORY_H 1
| #define HAVE_STRINGS_H 1
| #define HAVE_INTTYPES_H 1
| #define HAVE_STDINT_H 1
| #define HAVE_UNISTD_H 1
| /* end confdefs.h. */
| #include <stdio.h>
| #if HAVE_SYS_TYPES_H
| # include <sys/types.h>
| #endif
| #if HAVE_SYS_STAT_H
| # include <sys/stat.h>
| #endif
| #if STDC_HEADERS
| # include <stdlib.h>
| # include <stddef.h>
| #else
| # if HAVE_STDLIB_H
| # include <stdlib.h>
| # endif
| #endif
| #if HAVE_STRING_H
| # if !STDC_HEADERS && HAVE_MEMORY_H
| # include <memory.h>
| # endif
| # include <string.h>
| #endif
| #if HAVE_STRINGS_H
| # include <strings.h>
| #endif
| #if HAVE_INTTYPES_H
| # include <inttypes.h>
| #else
| # if HAVE_STDINT_H
| # include <stdint.h>
| # endif
| #endif
| #if HAVE_UNISTD_H
| # include <unistd.h>
| #endif
| #include <minix/config.h>
configure:4038: result: no
configure:4042: checking minix/config.h presence
configure:4052: gcc -E conftest.c
conftest.c:34:26: error: minix/config.h: No such file or directory
configure:4058: $? = 1
configure: failed program was:
| /* confdefs.h. */
|
| #define PACKAGE_NAME ""
| #define PACKAGE_TARNAME ""
| #define PACKAGE_VERSION ""
| #define PACKAGE_STRING ""
| #define PACKAGE_BUGREPORT ""
| #define PACKAGE "gsdl"
| #define VERSION "2.82-svn"
| #define MICO_DIR "default"
| #define USE_Z3950
| #define USE_YAZ
| #define USE_JDBM
| #define USE_GDBM
| #define ENABLE_ACCENTFOLD
| #define USE_SQLITE
| #define ENABLE_MG
| #define ENABLE_MGPP
| #define ENABLE_LUCENE
| #ifdef __cplusplus
| extern "C" void exit (int) throw ();
| #endif
| #define STDC_HEADERS 1
| #define HAVE_SYS_TYPES_H 1
| #define HAVE_SYS_STAT_H 1
| #define HAVE_STDLIB_H 1
| #define HAVE_STRING_H 1
| #define HAVE_MEMORY_H 1
| #define HAVE_STRINGS_H 1
| #define HAVE_INTTYPES_H 1
| #define HAVE_STDINT_H 1
| #define HAVE_UNISTD_H 1
| /* end confdefs.h. */
| #include <minix/config.h>
configure:4078: result: no
configure:4113: checking for minix/config.h
configure:4120: result: no
configure:4149: checking for gcc option to accept ANSI C
configure:4219: result:
configure:4227: checking for function prototypes
configure:4230: result: yes
configure:4243: checking for an ANSI C-conforming const
configure:4310: gcc -c -O2 conftest.c >&5
configure:4316: $? = 0
configure:4320: test -z
|| test ! -s conftest.err
configure:4323: $? = 0
configure:4326: test -s conftest.o
configure:4329: $? = 0
configure:4340: result: yes
configure:4350: checking for off_t
configure:4374: gcc -c -O2 conftest.c >&5
configure:4380: $? = 0
configure:4384: test -z
|| test ! -s conftest.err
configure:4387: $? = 0
configure:4390: test -s conftest.o
configure:4393: $? = 0
configure:4404: result: yes
configure:4416: checking for size_t
configure:4440: gcc -c -O2 conftest.c >&5
configure:4446: $? = 0
configure:4450: test -z
|| test ! -s conftest.err
configure:4453: $? = 0
configure:4456: test -s conftest.o
configure:4459: $? = 0
configure:4470: result: yes
configure:4482: checking whether time.h and sys/time.h may both be included
configure:4507: gcc -c -O2 conftest.c >&5
configure:4513: $? = 0
configure:4517: test -z
|| test ! -s conftest.err
configure:4520: $? = 0
configure:4523: test -s conftest.o
configure:4526: $? = 0
configure:4537: result: yes
configure:4547: checking whether struct tm is in sys/time.h or time.h
configure:4570: gcc -c -O2 conftest.c >&5
configure:4576: $? = 0
configure:4580: test -z
|| test ! -s conftest.err
configure:4583: $? = 0
configure:4586: test -s conftest.o
configure:4589: $? = 0
configure:4600: result: time.h
configure:4662: checking for main in -lg
configure:4686: gcc -o conftest -O2 conftest.c -lg >&5
configure:4692: $? = 0
configure:4696: test -z
|| test ! -s conftest.err
configure:4699: $? = 0
configure:4702: test -s conftest
configure:4705: $? = 0
configure:4718: result: yes
configure:4731: checking for main in -lm
configure:4755: gcc -o conftest -O2 conftest.c -lm -lg >&5
configure:4761: $? = 0
configure:4765: test -z
|| test ! -s conftest.err
configure:4768: $? = 0
configure:4771: test -s conftest
configure:4774: $? = 0
configure:4787: result: yes
configure:4800: checking for main in -lcrypt
configure:4824: gcc -o conftest -O2 conftest.c -lcrypt -lm -lg >&5
configure:4830: $? = 0
configure:4834: test -z
|| test ! -s conftest.err
configure:4837: $? = 0
configure:4840: test -s conftest
configure:4843: $? = 0
configure:4856: result: yes
configure:4880: checking for dirent.h that defines DIR
configure:4904: gcc -c -O2 conftest.c >&5
configure:4910: $? = 0
configure:4914: test -z
|| test ! -s conftest.err
configure:4917: $? = 0
configure:4920: test -s conftest.o
configure:4923: $? = 0
configure:4934: result: yes
configure:4947: checking for library containing opendir
configure:4977: gcc -o conftest -O2 conftest.c -lcrypt -lm -lg >&5
configure:4983: $? = 0
configure:4987: test -z
|| test ! -s conftest.err
configure:4990: $? = 0
configure:4993: test -s conftest
configure:4996: $? = 0
configure:5066: result: none required
configure:5202: checking for ANSI C header files
configure:5358: result: yes
configure:5390: checking fcntl.h usability
configure:5402: gcc -c -O2 conftest.c >&5
configure:5408: $? = 0
configure:5412: test -z
|| test ! -s conftest.err
configure:5415: $? = 0
configure:5418: test -s conftest.o
configure:5421: $? = 0
configure:5431: result: yes
configure:5435: checking fcntl.h presence
configure:5445: gcc -E conftest.c
configure:5451: $? = 0
configure:5471: result: yes
configure:5506: checking for fcntl.h
configure:5513: result: yes
configure:5390: checking limits.h usability
configure:5402: gcc -c -O2 conftest.c >&5
configure:5408: $? = 0
configure:5412: test -z
|| test ! -s conftest.err
configure:5415: $? = 0
configure:5418: test -s conftest.o
configure:5421: $? = 0
configure:5431: result: yes
configure:5435: checking limits.h presence
configure:5445: gcc -E conftest.c
configure:5451: $? = 0
configure:5471: result: yes
configure:5506: checking for limits.h
configure:5513: result: yes
configure:5390: checking sys/time.h usability
configure:5402: gcc -c -O2 conftest.c >&5
configure:5408: $? = 0
configure:5412: test -z
|| test ! -s conftest.err
configure:5415: $? = 0
configure:5418: test -s conftest.o
configure:5421: $? = 0
configure:5431: result: yes
configure:5435: checking sys/time.h presence
configure:5445: gcc -E conftest.c
configure:5451: $? = 0
configure:5471: result: yes
configure:5506: checking for sys/time.h
configure:5513: result: yes
configure:5381: checking for unistd.h
configure:5386: result: yes
configure:5390: checking crypt.h usability
configure:5402: gcc -c -O2 conftest.c >&5
configure:5408: $? = 0
configure:5412: test -z
|| test ! -s conftest.err
configure:5415: $? = 0
configure:5418: test -s conftest.o
configure:5421: $? = 0
configure:5431: result: yes
configure:5435: checking crypt.h presence
configure:5445: gcc -E conftest.c
configure:5451: $? = 0
configure:5471: result: yes
configure:5506: checking for crypt.h
configure:5513: result: yes
configure:5381: checking for string.h
configure:5386: result: yes
configure:5381: checking for memory.h
configure:5386: result: yes
configure:5390: checking sys/procfs.h usability
configure:5402: gcc -c -O2 conftest.c >&5
configure:5408: $? = 0
configure:5412: test -z
|| test ! -s conftest.err
configure:5415: $? = 0
configure:5418: test -s conftest.o
configure:5421: $? = 0
configure:5431: result: yes
configure:5435: checking sys/procfs.h presence
configure:5445: gcc -E conftest.c
configure:5451: $? = 0
configure:5471: result: yes
configure:5506: checking for sys/procfs.h
configure:5513: result: yes
configure:5381: checking for sys/stat.h
configure:5386: result: yes
configure:5583: checking for working alloca.h
configure:5604: gcc -o conftest -O2 conftest.c -lcrypt -lm -lg >&5
configure:5610: $? = 0
configure:5614: test -z
|| test ! -s conftest.err
configure:5617: $? = 0
configure:5620: test -s conftest
configure:5623: $? = 0
configure:5635: result: yes
configure:5645: checking for alloca
configure:5686: gcc -o conftest -O2 conftest.c -lcrypt -lm -lg >&5
configure:5692: $? = 0
configure:5696: test -z
|| test ! -s conftest.err
configure:5699: $? = 0
configure:5702: test -s conftest
configure:5705: $? = 0
configure:5717: result: yes
configure:5941: checking whether gcc needs -traditional
configure:5983: result: no
configure:5990: checking return type of signal handlers
configure:6021: gcc -c -O2 conftest.c >&5
configure:6027: $? = 0
configure:6031: test -z
|| test ! -s conftest.err
configure:6034: $? = 0
configure:6037: test -s conftest.o
configure:6040: $? = 0
configure:6051: result: void
configure:6063: checking for vprintf
configure:6120: gcc -o conftest -O2 conftest.c -lcrypt -lm -lg >&5
conftest.c:79: warning: conflicting types for built-in function 'vprintf'
configure:6126: $? = 0
configure:6130: test -z
|| test ! -s conftest.err
configure:6133: $? = 0
configure:6136: test -s conftest
configure:6139: $? = 0
configure:6151: result: yes
configure:6158: checking for _doprnt
configure:6215: gcc -o conftest -O2 conftest.c -lcrypt -lm -lg >&5
/tmp/ccY5c2Oz.o: In function `main':
conftest.c:(.text+0x9): undefined reference to `_doprnt'
/tmp/ccY5c2Oz.o:(.data+0x0): undefined reference to `_doprnt'
collect2: ld returned 1 exit status
configure:6221: $? = 1
configure: failed program was:
| /* confdefs.h. */
|
| #define PACKAGE_NAME ""
| #define PACKAGE_TARNAME ""
| #define PACKAGE_VERSION ""
| #define PACKAGE_STRING ""
| #define PACKAGE_BUGREPORT ""
| #define PACKAGE "gsdl"
| #define VERSION "2.82-svn"
| #define MICO_DIR "default"
| #define USE_Z3950
| #define USE_YAZ
| #define USE_JDBM
| #define USE_GDBM
| #define ENABLE_ACCENTFOLD
| #define USE_SQLITE
| #define ENABLE_MG
| #define ENABLE_MGPP
| #define ENABLE_LUCENE
| #ifdef __cplusplus
| extern "C" void exit (int) throw ();
| #endif
| #define STDC_HEADERS 1
| #define HAVE_SYS_TYPES_H 1
| #define HAVE_SYS_STAT_H 1
| #define HAVE_STDLIB_H 1
| #define HAVE_STRING_H 1
| #define HAVE_MEMORY_H 1
| #define HAVE_STRINGS_H 1
| #define HAVE_INTTYPES_H 1
| #define HAVE_STDINT_H 1
| #define HAVE_UNISTD_H 1
| #define PROTOTYPES 1
| #define TIME_WITH_SYS_TIME 1
| #define HAVE_LIBG 1
| #define HAVE_LIBM 1
| #define HAVE_LIBCRYPT 1
| #define HAVE_DIRENT_H 1
| #define STDC_HEADERS 1
| #define HAVE_FCNTL_H 1
| #define HAVE_LIMITS_H 1
| #define HAVE_SYS_TIME_H 1
| #define HAVE_UNISTD_H 1
| #define HAVE_CRYPT_H 1
| #define HAVE_STRING_H 1
| #define HAVE_MEMORY_H 1
| #define HAVE_SYS_PROCFS_H 1
| #define HAVE_SYS_STAT_H 1
| #define HAVE_FREAD_DECL 1
| #define HAVE_FGETC_DECL 1
| #define HAVE_ALLOCA_H 1
| #define HAVE_ALLOCA 1
| #define RETSIGTYPE void
| #define HAVE_VPRINTF 1
| /* end confdefs.h. */
| /* Define _doprnt to an innocuous variant, in case <limits.h> declares _doprnt.
| For example, HP-UX 11i <limits.h> declares gettimeofday. */
| #define _doprnt innocuous__doprnt
|
| /* System header to define __stub macros and hopefully few prototypes,
| which can conflict with char _doprnt (); below.
| Prefer <limits.h> to <assert.h> if __STDC__ is defined, since
| <limits.h> exists even on freestanding compilers. */
|
| #ifdef __STDC__
| # include <limits.h>
| #else
| # include <assert.h>
| #endif
|
| #undef _doprnt
|
| /* Override any gcc2 internal prototype to avoid an error. */
| #ifdef __cplusplus
| extern "C"
| {
| #endif
| /* We use char because int might match the return type of a gcc2
| builtin and then its argument prototype would still apply. */
| char _doprnt ();
| /* The GNU C library defines this for functions which it implements
| to always fail with ENOSYS. Some functions are actually named
| something starting with __ and the normal name is an alias. */
| #if defined (__stub__doprnt) || defined (__stub____doprnt)
| choke me
| #else
| char (*f) () = _doprnt;
| #endif
| #ifdef __cplusplus
| }
| #endif
|
| int
| main ()
| {
| return f != _doprnt;
| ;
| return 0;
| }
configure:6246: result: no
configure:6273: checking for ftime
configure:6330: gcc -o conftest -O2 conftest.c -lcrypt -lm -lg >&5
configure:6336: $? = 0
configure:6340: test -z
|| test ! -s conftest.err
configure:6343: $? = 0
configure:6346: test -s conftest
configure:6349: $? = 0
configure:6361: result: yes
configure:6273: checking for select
configure:6330: gcc -o conftest -O2 conftest.c -lcrypt -lm -lg >&5
configure:6336: $? = 0
configure:6340: test -z
|| test ! -s conftest.err
configure:6343: $? = 0
configure:6346: test -s conftest
configure:6349: $? = 0
configure:6361: result: yes
configure:6273: checking for strftime
configure:6330: gcc -o conftest -O2 conftest.c -lcrypt -lm -lg >&5
conftest.c:82: warning: conflicting types for built-in function 'strftime'
configure:6336: $? = 0
configure:6340: test -z
|| test ! -s conftest.err
configure:6343: $? = 0
configure:6346: test -s conftest
configure:6349: $? = 0
configure:6361: result: yes
configure:6273: checking for strtol
configure:6330: gcc -o conftest -O2 conftest.c -lcrypt -lm -lg >&5
configure:6336: $? = 0
configure:6340: test -z
|| test ! -s conftest.err
configure:6343: $? = 0
configure:6346: test -s conftest
configure:6349: $? = 0
configure:6361: result: yes
configure:6273: checking for getrusage
configure:6330: gcc -o conftest -O2 conftest.c -lcrypt -lm -lg >&5
configure:6336: $? = 0
configure:6340: test -z
|| test ! -s conftest.err
configure:6343: $? = 0
configure:6346: test -s conftest
configure:6349: $? = 0
configure:6361: result: yes
configure:6273: checking for times
configure:6330: gcc -o conftest -O2 conftest.c -lcrypt -lm -lg >&5
configure:6336: $? = 0
configure:6340: test -z
|| test ! -s conftest.err
configure:6343: $? = 0
configure:6346: test -s conftest
configure:6349: $? = 0
configure:6361: result: yes
configure:6273: checking for mallinfo
configure:6330: gcc -o conftest -O2 conftest.c -lcrypt -lm -lg >&5
configure:6336: $? = 0
configure:6340: test -z
|| test ! -s conftest.err
configure:6343: $? = 0
configure:6346: test -s conftest
configure:6349: $? = 0
configure:6361: result: yes
configure:6273: checking for setbuffer
configure:6330: gcc -o conftest -O2 conftest.c -lcrypt -lm -lg >&5
configure:6336: $? = 0
configure:6340: test -z
|| test ! -s conftest.err
configure:6343: $? = 0
configure:6346: test -s conftest
configure:6349: $? = 0
configure:6361: result: yes
configure:6273: checking for getpagesize
configure:6330: gcc -o conftest -O2 conftest.c -lcrypt -lm -lg >&5
configure:6336: $? = 0
configure:6340: test -z
|| test ! -s conftest.err
configure:6343: $? = 0
configure:6346: test -s conftest
configure:6349: $? = 0
configure:6361: result: yes
configure:6273: checking for strerror
configure:6330: gcc -o conftest -O2 conftest.c -lcrypt -lm -lg >&5
configure:6336: $? = 0
configure:6340: test -z
|| test ! -s conftest.err
configure:6343: $? = 0
configure:6346: test -s conftest
configure:6349: $? = 0
configure:6361: result: yes
configure:6377: checking for ftruncate
configure:6434: gcc -o conftest -O2 conftest.c -lcrypt -lm -lg >&5
configure:6440: $? = 0
configure:6444: test -z
|| test ! -s conftest.err
configure:6447: $? = 0
configure:6450: test -s conftest
configure:6453: $? = 0
configure:6465: result: yes
configure:6377: checking for strstr
configure:6434: gcc -o conftest -O2 conftest.c -lcrypt -lm -lg >&5
conftest.c:91: warning: conflicting types for built-in function 'strstr'
configure:6440: $? = 0
configure:6444: test -z
|| test ! -s conftest.err
configure:6447: $? = 0
configure:6450: test -s conftest
configure:6453: $? = 0
configure:6465: result: yes
configure:6377: checking for strcasecmp
configure:6434: gcc -o conftest -O2 conftest.c -lcrypt -lm -lg >&5
conftest.c:92: warning: conflicting types for built-in function 'strcasecmp'
configure:6440: $? = 0
configure:6444: test -z
|| test ! -s conftest.err
configure:6447: $? = 0
configure:6450: test -s conftest
configure:6453: $? = 0
configure:6465: result: yes
configure:6486: checking for textdomain
configure:6543: gcc -o conftest -O2 conftest.c -lcrypt -lm -lg >&5
configure:6549: $? = 0
configure:6553: test -z
|| test ! -s conftest.err
configure:6556: $? = 0
configure:6559: test -s conftest
configure:6562: $? = 0
configure:6574: result: yes
configure:6586: checking for HP-UX needing gmalloc
configure:6604: result: no
configure:6610: checking for valloc
configure:6667: gcc -o conftest -O2 conftest.c -lcrypt -lm -lg >&5
configure:6673: $? = 0
configure:6677: test -z
|| test ! -s conftest.err
configure:6680: $? = 0
configure:6683: test -s conftest
configure:6686: $? = 0
configure:6698: result: yes
configure:6711: checking for Apple MacOS X/Darwin
configure:6718: result: no
configure:6724: checking if malloc debugging is wanted
configure:6744: result: no
configure:6748: checking which of rx or regex is wanted
configure:6773: result: rx
configure:6775: checking for re_rx_search
configure:6832: gcc -o conftest -O2 conftest.c -lcrypt -lm -lg >&5
/tmp/ccJ5GDdR.o: In function `main':
conftest.c:(.text+0x9): undefined reference to `re_rx_search'
/tmp/ccJ5GDdR.o:(.data+0x0): undefined reference to `re_rx_search'
collect2: ld returned 1 exit status
configure:6838: $? = 1
configure: failed program was:
| /* confdefs.h. */
|
| #define PACKAGE_NAME ""
| #define PACKAGE_TARNAME ""
| #define PACKAGE_VERSION ""
| #define PACKAGE_STRING ""
| #define PACKAGE_BUGREPORT ""
| #define PACKAGE "gsdl"
| #define VERSION "2.82-svn"
| #define MICO_DIR "default"
| #define USE_Z3950
| #define USE_YAZ
| #define USE_JDBM
| #define USE_GDBM
| #define ENABLE_ACCENTFOLD
| #define USE_SQLITE
| #define ENABLE_MG
| #define ENABLE_MGPP
| #define ENABLE_LUCENE
| #ifdef __cplusplus
| extern "C" void exit (int) throw ();
| #endif
| #define STDC_HEADERS 1
| #define HAVE_SYS_TYPES_H 1
| #define HAVE_SYS_STAT_H 1
| #define HAVE_STDLIB_H 1
| #define HAVE_STRING_H 1
| #define HAVE_MEMORY_H 1
| #define HAVE_STRINGS_H 1
| #define HAVE_INTTYPES_H 1
| #define HAVE_STDINT_H 1
| #define HAVE_UNISTD_H 1
| #define PROTOTYPES 1
| #define TIME_WITH_SYS_TIME 1
| #define HAVE_LIBG 1
| #define HAVE_LIBM 1
| #define HAVE_LIBCRYPT 1
| #define HAVE_DIRENT_H 1
| #define STDC_HEADERS 1
| #define HAVE_FCNTL_H 1
| #define HAVE_LIMITS_H 1
| #define HAVE_SYS_TIME_H 1
| #define HAVE_UNISTD_H 1
| #define HAVE_CRYPT_H 1
| #define HAVE_STRING_H 1
| #define HAVE_MEMORY_H 1
| #define HAVE_SYS_PROCFS_H 1
| #define HAVE_SYS_STAT_H 1
| #define HAVE_FREAD_DECL 1
| #define HAVE_FGETC_DECL 1
| #define HAVE_ALLOCA_H 1
| #define HAVE_ALLOCA 1
| #define RETSIGTYPE void
| #define HAVE_VPRINTF 1
| #define HAVE_FTIME 1
| #define HAVE_SELECT 1
| #define HAVE_STRFTIME 1
| #define HAVE_STRTOL 1
| #define HAVE_GETRUSAGE 1
| #define HAVE_TIMES 1
| #define HAVE_MALLINFO 1
| #define HAVE_SETBUFFER 1
| #define HAVE_GETPAGESIZE 1
| #define HAVE_STRERROR 1
| #define HAVE_FTRUNCATE 1
| #define HAVE_STRSTR 1
| #define HAVE_STRCASECMP 1
| #define ENABLE_NLS 1
| #define HAVE_VALLOC 1
| /* end confdefs.h. */
| /* Define re_rx_search to an innocuous variant, in case <limits.h> declares re_rx_search.
| For example, HP-UX 11i <limits.h> declares gettimeofday. */
| #define re_rx_search innocuous_re_rx_search
|
| /* System header to define __stub macros and hopefully few prototypes,
| which can conflict with char re_rx_search (); below.
| Prefer <limits.h> to <assert.h> if __STDC__ is defined, since
| <limits.h> exists even on freestanding compilers. */
|
| #ifdef __STDC__
| # include <limits.h>
| #else
| # include <assert.h>
| #endif
|
| #undef re_rx_search
|
| /* Override any gcc2 internal prototype to avoid an error. */
| #ifdef __cplusplus
| extern "C"
| {
| #endif
| /* We use char because int might match the return type of a gcc2
| builtin and then its argument prototype would still apply. */
| char re_rx_search ();
| /* The GNU C library defines this for functions which it implements
| to always fail with ENOSYS. Some functions are actually named
| something starting with __ and the normal name is an alias. */
| #if defined (__stub_re_rx_search) || defined (__stub___re_rx_search)
| choke me
| #else
| char (*f) () = re_rx_search;
| #endif
| #ifdef __cplusplus
| }
| #endif
|
| int
| main ()
| {
| return f != re_rx_search;
| ;
| return 0;
| }
configure:6863: result: no
configure:6911: checking that Perl 5 is available
configure:6929: result: "yes"
configure:6945: checking "whether STL library has known faults"
configure:6966: g++ -c -g -O2 conftest.cc >&5
configure:6972: $? = 0
configure:6976: test -z
|| test ! -s conftest.err
configure:6979: $? = 0
configure:6982: test -s conftest.o
configure:6985: $? = 0
configure:7092: result: "no"
configure:7111: checking whether byte ordering is bigendian
configure:7138: g++ -c -g -O2 conftest.cc >&5
configure:7144: $? = 0
configure:7148: test -z
|| test ! -s conftest.err
configure:7151: $? = 0
configure:7154: test -s conftest.o
configure:7157: $? = 0
configure:7181: g++ -c -g -O2 conftest.cc >&5
conftest.cc: In function 'int main()':
conftest.cc:78: error: 'big' was not declared in this scope
conftest.cc:78: error: expected ';' before 'endian'
configure:7187: $? = 1
configure: failed program was:
| /* confdefs.h. */
|
| #define PACKAGE_NAME ""
| #define PACKAGE_TARNAME ""
| #define PACKAGE_VERSION ""
| #define PACKAGE_STRING ""
| #define PACKAGE_BUGREPORT ""
| #define PACKAGE "gsdl"
| #define VERSION "2.82-svn"
| #define MICO_DIR "default"
| #define USE_Z3950
| #define USE_YAZ
| #define USE_JDBM
| #define USE_GDBM
| #define ENABLE_ACCENTFOLD
| #define USE_SQLITE
| #define ENABLE_MG
| #define ENABLE_MGPP
| #define ENABLE_LUCENE
| #ifdef __cplusplus
| extern "C" void exit (int) throw ();
| #endif
| #define STDC_HEADERS 1
| #define HAVE_SYS_TYPES_H 1
| #define HAVE_SYS_STAT_H 1
| #define HAVE_STDLIB_H 1
| #define HAVE_STRING_H 1
| #define HAVE_MEMORY_H 1
| #define HAVE_STRINGS_H 1
| #define HAVE_INTTYPES_H 1
| #define HAVE_STDINT_H 1
| #define HAVE_UNISTD_H 1
| #define PROTOTYPES 1
| #define TIME_WITH_SYS_TIME 1
| #define HAVE_LIBG 1
| #define HAVE_LIBM 1
| #define HAVE_LIBCRYPT 1
| #define HAVE_DIRENT_H 1
| #define STDC_HEADERS 1
| #define HAVE_FCNTL_H 1
| #define HAVE_LIMITS_H 1
| #define HAVE_SYS_TIME_H 1
| #define HAVE_UNISTD_H 1
| #define HAVE_CRYPT_H 1
| #define HAVE_STRING_H 1
| #define HAVE_MEMORY_H 1
| #define HAVE_SYS_PROCFS_H 1
| #define HAVE_SYS_STAT_H 1
| #define HAVE_FREAD_DECL 1
| #define HAVE_FGETC_DECL 1
| #define HAVE_ALLOCA_H 1
| #define HAVE_ALLOCA 1
| #define RETSIGTYPE void
| #define HAVE_VPRINTF 1
| #define HAVE_FTIME 1
| #define HAVE_SELECT 1
| #define HAVE_STRFTIME 1
| #define HAVE_STRTOL 1
| #define HAVE_GETRUSAGE 1
| #define HAVE_TIMES 1
| #define HAVE_MALLINFO 1
| #define HAVE_SETBUFFER 1
| #define HAVE_GETPAGESIZE 1
| #define HAVE_STRERROR 1
| #define HAVE_FTRUNCATE 1
| #define HAVE_STRSTR 1
| #define HAVE_STRCASECMP 1
| #define ENABLE_NLS 1
| #define HAVE_VALLOC 1
| /* end confdefs.h. */
| #include <sys/types.h>
| #include <sys/param.h>
|
| int
| main ()
| {
| #if BYTE_ORDER != BIG_ENDIAN
| not big endian
| #endif
|
| ;
| return 0;
| }
configure:7322: result: no
configure:7503: creating ./config.status

## ---------------------- ##
## Running config.status. ##
## ---------------------- ##

This file was extended by config.status, which was
generated by GNU Autoconf 2.59. Invocation command line was

CONFIG_FILES =
CONFIG_HEADERS =
CONFIG_LINKS =
CONFIG_COMMANDS =
$ ./config.status

on x200

config.status:698: creating Makefile
config.status:698: creating common-src/Makefile
config.status:698: creating build-src/Makefile
config.status:698: creating runtime-src/Makefile
config.status:802: creating config.h
config.status:1020: config.h is unchanged
configure:8619: configuring in common-src
configure:8736: running /bin/bash './configure' --prefix=/usr/local '--enable-z3950' --bindir=/home/biligee/gsdl/bin/linux --libdir=/home/biligee/gsdl/lib/linux --cache-file=/dev/null --srcdir=.
configure:8619: configuring in build-src
configure:8736: running /bin/bash './configure' --prefix=/usr/local '--enable-z3950' --bindir=/home/biligee/gsdl/bin/linux --libdir=/home/biligee/gsdl/lib/linux --cache-file=/dev/null --srcdir=.
configure:8619: configuring in runtime-src
configure:8736: running /bin/bash './configure' --prefix=/usr/local '--enable-z3950' --bindir=/home/biligee/gsdl/bin/linux --libdir=/home/biligee/gsdl/lib/linux --cache-file=/dev/null --srcdir=.

## ---------------- ##
## Cache variables. ##
## ---------------- ##

ac_cv_build=x86_64-unknown-linux-gnu
ac_cv_build_alias=x86_64-unknown-linux-gnu
ac_cv_c_bigendian=no
ac_cv_c_compiler_gnu=yes
ac_cv_c_const=yes
ac_cv_cxx_compiler_gnu=yes
ac_cv_env_CC_set=
ac_cv_env_CC_value=
ac_cv_env_CFLAGS_set=
ac_cv_env_CFLAGS_value=
ac_cv_env_CPPFLAGS_set=
ac_cv_env_CPPFLAGS_value=
ac_cv_env_CPP_set=
ac_cv_env_CPP_value=
ac_cv_env_CXXFLAGS_set=
ac_cv_env_CXXFLAGS_value=
ac_cv_env_CXX_set=
ac_cv_env_CXX_value=
ac_cv_env_LDFLAGS_set=
ac_cv_env_LDFLAGS_value=
ac_cv_env_build_alias_set=
ac_cv_env_build_alias_value=
ac_cv_env_host_alias_set=
ac_cv_env_host_alias_value=
ac_cv_env_target_alias_set=
ac_cv_env_target_alias_value=
ac_cv_exeext=
ac_cv_func__doprnt=no
ac_cv_func_alloca_works=yes
ac_cv_func_ftime=yes
ac_cv_func_ftruncate=yes
ac_cv_func_getpagesize=yes
ac_cv_func_getrusage=yes
ac_cv_func_mallinfo=yes
ac_cv_func_re_rx_search=no
ac_cv_func_select=yes
ac_cv_func_setbuffer=yes
ac_cv_func_strcasecmp=yes
ac_cv_func_strerror=yes
ac_cv_func_strftime=yes
ac_cv_func_strstr=yes
ac_cv_func_strtol=yes
ac_cv_func_textdomain=yes
ac_cv_func_times=yes
ac_cv_func_valloc=yes
ac_cv_func_vprintf=yes
ac_cv GSDL Error

crypt_h=yes
ac_cv GSDL Error
dirent_dirent_h=yes
ac_cv GSDL Error
fcntl_h=yes
ac_cv GSDL Error
inttypes_h=yes
ac_cv GSDL Error
limits_h=yes
ac_cv GSDL Error
memory_h=yes
ac_cv GSDL Error
minix_config_h=no
ac_cv GSDL Error
stdc=yes
ac_cv GSDL Error
stdint_h=yes
ac_cv_header_stdlib_h=yes
ac_cv GSDL Error
string_h=yes
ac_cv GSDL Error
strings_h=yes
ac_cv GSDL Error
sys_procfs_h=yes
ac_cv GSDL Error
sys_stat_h=yes
ac_cv GSDL Error
sys_time_h=yes
ac_cv GSDL Error
sys_types_h=yes
ac_cv GSDL Error
time=yes
ac_cv GSDL Error
unistd_h=yes
ac_cv_host=x86_64-unknown-linux-gnu
ac_cv_host_alias=x86_64-unknown-linux-gnu
ac_cv_lib_crypt=ac_cv_lib_crypt_main
ac_cv_lib_crypt_main=yes
ac_cv_lib_g=ac_cv_lib_g_main
ac_cv_lib_g_main=yes
ac_cv_lib_m=ac_cv_lib_m_main
ac_cv_lib_m_main=yes
ac_cv_objext=o
ac_cv_path_install='/usr/bin/install -c'
ac_cv_prog_AWK=gawk
ac_cv_prog_CPP='gcc -E'
ac_cv_prog_ac_ct_CC=gcc
ac_cv_prog_ac_ct_CXX=g++
ac_cv_prog_ac_ct_RANLIB=ranlib
ac_cv_prog_cc_g=yes
ac_cv_prog_cc_stdc=
ac_cv_prog_cxx_g=yes
ac_cv_prog_egrep='grep -E'
ac_cv_prog_gcc_traditional=no
ac_cv_prog_make_make_set=yes
ac_cv_search_opendir='none required'
ac_cv_search_strerror='none required'
ac_cv_struct_tm=time.h
ac_cv_target=x86_64-unknown-linux-gnu
ac_cv_target_alias=x86_64-unknown-linux-gnu
ac_cv_type_off_t=yes
ac_cv_type_signal=void
ac_cv_type_size_t=yes
ac_cv_working_alloca_h=yes

## ----------------- ##
## Output variables. ##
## ----------------- ##

ALLOCA=''
ANSI2KNR=''
AWK='gawk'
CC='gcc'
CFLAGS='-O2'
COMPAT32BITFLAGS='-m32'
CPP='gcc -E'
CPPFLAGS=''
CXX='g++'
CXXFLAGS='-g -O2'
DEFS='-DHAVE_CONFIG_H'
ECHO_C=''
ECHO_N='-n'
ECHO_T=''
EGREP='grep -E'
ENABLE_ACCENTFOLD='1'
ENABLE_JNI='0'
ENABLE_LUCENE='1'
ENABLE_MG='1'
ENABLE_MGPP='1'
EXEEXT=''
INSTALL_DATA='${INSTALL} -m 644'
INSTALL_PROGRAM='${INSTALL}'
INSTALL_SCRIPT='${INSTALL}'
LDFLAGS=''
LIBOBJS=' rx$U.o'
LIBS='-lcrypt -lm -lg '
LN_S='ln -s'
LTLIBOBJS=' rx$U.lo'
MICO_DIR='default'
MICO_VER=''
MODULEDIRS=''
OBJEXT='o'
PACKAGE='gsdl'
PACKAGE_BUGREPORT=''
PACKAGE_NAME=''
PACKAGE_STRING=''
PACKAGE_TARNAME=''
PACKAGE_VERSION=''
PATH_SEPARATOR=':'
RANLIB='ranlib'
SET_MAKE=''
SHELL='/bin/bash'
STATIC='-static '
U=''
USE_APACHE_HTTPD='0'
USE_CORBA='0'
USE_FASTCGI='0'
USE_GDBM='1'
USE_JDBM='1'
USE_LANGACTION=''
USE_SQLITE='1'
USE_YAZ='1'
USE_Z3950='1'
VERSION='2.82-svn'
YACC='yacc'
ac_ct_CC='gcc'
ac_ct_CXX='g++'
ac_ct_RANLIB='ranlib'
bindir='${exec_prefix}/bin'
build='x86_64-unknown-linux-gnu'
build_alias=''
build_cpu='x86_64'
build_os='linux-gnu'
build_vendor='unknown'
datadir='${prefix}/share'
exec_prefix='${prefix}'
gsdlos='linux'
host='x86_64-unknown-linux-gnu'
host_alias=''
host_cpu='x86_64'
host_os='linux-gnu'
host_vendor='unknown'
includedir='${prefix}/include'
infodir='${prefix}/info'
libdir='${exec_prefix}/lib'
libexecdir='${exec_prefix}/libexec'
localstatedir='${prefix}/var'
mandir='${prefix}/man'
oldincludedir='/usr/include'
prefix='/usr/local'
program_transform_name='s,x,x,'
sbindir='${exec_prefix}/sbin'
sharedstatedir='${prefix}/com'
subdirs=' common-src build-src runtime-src'
sysconfdir='${prefix}/etc'
target='x86_64-unknown-linux-gnu'
target_alias=''
target_cpu='x86_64'
target_os='linux-gnu'
target_vendor='unknown'

## ----------- ##
## confdefs.h. ##
## ----------- ##

#define ENABLE_ACCENTFOLD
#define ENABLE_LUCENE
#define ENABLE_MG
#define ENABLE_MGPP
#define ENABLE_NLS 1
#define HAVE_ALLOCA 1
#define HAVE_ALLOCA_H 1
#define HAVE_CRYPT_H 1
#define HAVE_DIRENT_H 1
#define HAVE_FCNTL_H 1
#define HAVE_FGETC_DECL 1
#define HAVE_FREAD_DECL 1
#define HAVE_FTIME 1
#define HAVE_FTRUNCATE 1
#define HAVE_GETPAGESIZE 1
#define HAVE_GETRUSAGE 1
#define HAVE_INTTYPES_H 1
#define HAVE_LIBCRYPT 1
#define HAVE_LIBG 1
#define HAVE_LIBM 1
#define HAVE_LIMITS_H 1
#define HAVE_MALLINFO 1
#define HAVE_MEMORY_H 1
#define HAVE_MEMORY_H 1
#define HAVE_SELECT 1
#define HAVE_SETBUFFER 1
#define HAVE_STDINT_H 1
#define HAVE_STDLIB_H 1
#define HAVE_STRCASECMP 1
#define HAVE_STRERROR 1
#define HAVE_STRFTIME 1
#define HAVE_STRINGS_H 1
#define HAVE_STRING_H 1
#define HAVE_STRING_H 1
#define HAVE_STRSTR 1
#define HAVE_STRTOL 1
#define HAVE_SYS_PROCFS_H 1
#define HAVE_SYS_STAT_H 1
#define HAVE_SYS_STAT_H 1
#define HAVE_SYS_TIME_H 1
#define HAVE_SYS_TYPES_H 1
#define HAVE_TIMES 1
#define HAVE_UNISTD_H 1
#define HAVE_UNISTD_H 1
#define HAVE_VALLOC 1
#define HAVE_VPRINTF 1
#define MICO_DIR "default"
#define PACKAGE "gsdl"
#define PACKAGE_BUGREPORT ""
#define PACKAGE_NAME ""
#define PACKAGE_STRING ""
#define PACKAGE_TARNAME ""
#define PACKAGE_VERSION ""
#define PROTOTYPES 1
#define RETSIGTYPE void
#define STDC_HEADERS 1
#define STDC_HEADERS 1
#define TIME_WITH_SYS_TIME 1
#define USE_GDBM
#define USE_JDBM
#define USE_SQLITE
#define USE_YAZ
#define USE_Z3950
#define VERSION "2.82-svn"
#endif
#ifdef __cplusplus
extern "C" void exit (int) throw ();

configure: exit 0
-------------- next part --------------
This file contains any messages produced by compilers while
running configure, to aid debugging if configure makes a mistake.

It was created by configure, which was
generated by GNU Autoconf 2.59. Invocation command line was

$ ./configure --enable-z3950

## --------- ##
## Platform. ##
## --------- ##

hostname = localhost.localdomain
uname -m = i686
uname -r = 2.6.9-89.EL
uname -s = Linux
uname -v = #1 Mon Jun 22 12:19:40 EDT 2009

/usr/bin/uname -p = unknown
/bin/uname -X = unknown

/bin/arch = i686
/usr/bin/arch -k = unknown
/usr/convex/getsysinfo = unknown
hostinfo = unknown
/bin/machine = unknown
/usr/bin/oslevel = unknown
/bin/universe = unknown

PATH: /usr/kerberos/sbin
PATH: /usr/kerberos/bin
PATH: /usr/local/bin
PATH: /usr/bin
PATH: /bin
PATH: /usr/X11R6/bin
PATH: /home/biligee/bin


## ----------- ##
## Core tests. ##
## ----------- ##

configure:1503: checking for gcc
configure:1519: found /usr/bin/gcc
configure:1529: result: gcc
configure:1773: checking for C compiler version
configure:1776: gcc --version </dev/null >&5
gcc (GCC) 3.4.6 20060404 (Red Hat 3.4.6-11)
Copyright (C) 2006 Free Software Foundation, Inc.
This is free software; see the source for copying conditions. There is NO
warranty; not even for MERCHANTABILITY or FITNESS FOR A PARTICULAR PURPOSE.

configure:1779: $? = 0
configure:1781: gcc -v </dev/null >&5
Reading specs from /usr/lib/gcc/i386-redhat-linux/3.4.6/specs
Configured with: ../configure --prefix=/usr --mandir=/usr/share/man --infodir=/usr/share/info --enable-shared --enable-threads=posix --disable-checking --with-system-zlib --enable-__cxa_atexit --disable-libunwind-exceptions --enable-java-awt=gtk --host=i386-redhat-linux
Thread model: posix
gcc version 3.4.6 20060404 (Red Hat 3.4.6-11)
configure:1784: $? = 0
configure:1786: gcc -V </dev/null >&5
gcc: `-V' option must have argument
configure:1789: $? = 1
configure:1812: checking for C compiler default output file name
configure:1815: gcc -O2 conftest.c >&5
configure:1818: $? = 0
configure:1864: result: a.out
configure:1869: checking whether the C compiler works
configure:1875: ./a.out
configure:1878: $? = 0
configure:1895: result: yes
configure:1902: checking whether we are cross compiling
configure:1904: result: no
configure:1907: checking for suffix of executables
configure:1909: gcc -o conftest -O2 conftest.c >&5
configure:1912: $? = 0
configure:1937: result:
configure:1943: checking for suffix of object files
configure:1964: gcc -c -O2 conftest.c >&5
configure:1967: $? = 0
configure:1989: result: o
configure:1993: checking whether we are using the GNU C compiler
configure:2017: gcc -c -O2 conftest.c >&5
configure:2023: $? = 0
configure:2027: test -z
|| test ! -s conftest.err
configure:2030: $? = 0
configure:2033: test -s conftest.o
configure:2036: $? = 0
configure:2049: result: yes
configure:2055: checking whether gcc accepts -g
configure:2076: gcc -c -g conftest.c >&5
configure:2082: $? = 0
configure:2086: test -z
|| test ! -s conftest.err
configure:2089: $? = 0
configure:2092: test -s conftest.o
configure:2095: $? = 0
configure:2106: result: yes
configure:2123: checking for gcc option to accept ANSI C
configure:2193: gcc -c -O2 conftest.c >&5
configure:2199: $? = 0
configure:2203: test -z
|| test ! -s conftest.err
configure:2206: $? = 0
configure:2209: test -s conftest.o
configure:2212: $? = 0
configure:2230: result: none needed
configure:2248: gcc -c -O2 conftest.c >&5
conftest.c:2: error: syntax error before "me"
configure:2254: $? = 1
configure: failed program was:
| #ifndef __cplusplus
| choke me
| #endif
configure:2439: checking for g++
configure:2468: result: no
configure:2439: checking for c++
configure:2468: result: no
configure:2439: checking for gpp
configure:2468: result: no
configure:2439: checking for aCC
configure:2468: result: no
configure:2439: checking for CC
configure:2468: result: no
configure:2439: checking for cxx
configure:2468: result: no
configure:2439: checking for cc++
configure:2468: result: no
configure:2439: checking for cl
configure:2468: result: no
configure:2439: checking for FCC
configure:2468: result: no
configure:2439: checking for KCC
configure:2468: result: no
configure:2439: checking for RCC
configure:2468: result: no
configure:2439: checking for xlC_r
configure:2468: result: no
configure:2439: checking for xlC
configure:2468: result: no
configure:2481: checking for C++ compiler version
configure:2484: g++ --version </dev/null >&5
./configure: line 2485: g++: command not found
configure:2487: $? = 127
configure:2489: g++ -v </dev/null >&5
./configure: line 2490: g++: command not found
configure:2492: $? = 127
configure:2494: g++ -V </dev/null >&5
./configure: line 2495: g++: command not found
configure:2497: $? = 127
configure:2500: checking whether we are using the GNU C++ compiler
configure:2524: g++ -c conftest.cc >&5
./configure: line 2525: g++: command not found
configure:2530: $? = 127
configure: failed program was:
| /* confdefs.h. */
|
| #define PACKAGE_NAME ""
| #define PACKAGE_TARNAME ""
| #define PACKAGE_VERSION ""
| #define PACKAGE_STRING ""
| #define PACKAGE_BUGREPORT ""
| #define PACKAGE "gsdl"
| #define VERSION "2.82-svn"
| #define USE_CORBA 0
| #define MICO_DIR "default"
| #define USE_YAZ $USE_YAZ
| #define ENABLE_ACCENTFOLD $ENABLE_ACCENTFOLD
| #define USE_SQLITE $USE_SQLITE
| #define USE_APACHE_HTTPD $USE_APACHE_HTTPD
| /* end confdefs.h. */
|
| int
| main ()
| {
| #ifndef __GNUC__
| choke me
| #endif
|
| ;
| return 0;
| }
configure:2556: result: no
configure:2562: checking whether g++ accepts -g
configure:2583: g++ -c -g conftest.cc >&5
./configure: line 2584: g++: command not found
configure:2589: $? = 127
configure: failed program was:
| /* confdefs.h. */
|
| #define PACKAGE_NAME ""
| #define PACKAGE_TARNAME ""
| #define PACKAGE_VERSION ""
| #define PACKAGE_STRING ""
| #define PACKAGE_BUGREPORT ""
| #define PACKAGE "gsdl"
| #define VERSION "2.82-svn"
| #define USE_CORBA 0
| #define MICO_DIR "default"
| #define USE_YAZ $USE_YAZ
| #define ENABLE_ACCENTFOLD $ENABLE_ACCENTFOLD
| #define USE_SQLITE $USE_SQLITE
| #define USE_APACHE_HTTPD $USE_APACHE_HTTPD
| /* end confdefs.h. */
|
| int
| main ()
| {
|
| ;
| return 0;
| }
configure:2613: result: no
configure:2655: g++ -c conftest.cc >&5
./configure: line 2656: g++: command not found
configure:2661: $? = 127
configure: failed program was:
| /* confdefs.h. */
|
| #define PACKAGE_NAME ""
| #define PACKAGE_TARNAME ""
| #define PACKAGE_VERSION ""
| #define PACKAGE_STRING ""
| #define PACKAGE_BUGREPORT ""
| #define PACKAGE "gsdl"
| #define VERSION "2.82-svn"
| #define USE_CORBA 0
| #define MICO_DIR "default"
| #define USE_YAZ $USE_YAZ
| #define ENABLE_ACCENTFOLD $ENABLE_ACCENTFOLD
| #define USE_SQLITE $USE_SQLITE
| #define USE_APACHE_HTTPD $USE_APACHE_HTTPD
| /* end confdefs.h. */
|
| #include <stdlib.h>
| int
| main ()
| {
| exit (42);
| ;
| return 0;
| }
configure:2655: g++ -c conftest.cc >&5
./configure: line 2656: g++: command not found
configure:2661: $? = 127
configure: failed program was:
| /* confdefs.h. */
|
| #define PACKAGE_NAME ""
| #define PACKAGE_TARNAME ""
| #define PACKAGE_VERSION ""
| #define PACKAGE_STRING ""
| #define PACKAGE_BUGREPORT ""
| #define PACKAGE "gsdl"
| #define VERSION "2.82-svn"
| #define USE_CORBA 0
| #define MICO_DIR "default"
| #define USE_YAZ $USE_YAZ
| #define ENABLE_ACCENTFOLD $ENABLE_ACCENTFOLD
| #define USE_SQLITE $USE_SQLITE
| #define USE_APACHE_HTTPD $USE_APACHE_HTTPD
| /* end confdefs.h. */
| extern "C" void std::exit (int) throw (); using std::exit;
| #include <stdlib.h>
| int
| main ()
| {
| exit (42);
| ;
| return 0;
| }
configure:2655: g++ -c conftest.cc >&5
./configure: line 2656: g++: command not found
configure:2661: $? = 127
configure: failed program was:
| /* confdefs.h. */
|
| #define PACKAGE_NAME ""
| #define PACKAGE_TARNAME ""
| #define PACKAGE_VERSION ""
| #define PACKAGE_STRING ""
| #define PACKAGE_BUGREPORT ""
| #define PACKAGE "gsdl"
| #define VERSION "2.82-svn"
| #define USE_CORBA 0
| #define MICO_DIR "default"
| #define USE_YAZ $USE_YAZ
| #define ENABLE_ACCENTFOLD $ENABLE_ACCENTFOLD
| #define USE_SQLITE $USE_SQLITE
| #define USE_APACHE_HTTPD $USE_APACHE_HTTPD
| /* end confdefs.h. */
| extern "C" void std::exit (int); using std::exit;
| #include <stdlib.h>
| int
| main ()
| {
| exit (42);
| ;
| return 0;
| }
configure:2655: g++ -c conftest.cc >&5
./configure: line 2656: g++: command not found
configure:2661: $? = 127
configure: failed program was:
| /* confdefs.h. */
|
| #define PACKAGE_NAME ""
| #define PACKAGE_TARNAME ""
| #define PACKAGE_VERSION ""
| #define PACKAGE_STRING ""
| #define PACKAGE_BUGREPORT ""
| #define PACKAGE "gsdl"
| #define VERSION "2.82-svn"
| #define USE_CORBA 0
| #define MICO_DIR "default"
| #define USE_YAZ $USE_YAZ
| #define ENABLE_ACCENTFOLD $ENABLE_ACCENTFOLD
| #define USE_SQLITE $USE_SQLITE
| #define USE_APACHE_HTTPD $USE_APACHE_HTTPD
| /* end confdefs.h. */
| extern "C" void exit (int) throw ();
| #include <stdlib.h>
| int
| main ()
| {
| exit (42);
| ;
| return 0;
| }
configure:2655: g++ -c conftest.cc >&5
./configure: line 2656: g++: command not found
configure:2661: $? = 127
configure: failed program was:
| /* confdefs.h. */
|
| #define PACKAGE_NAME ""
| #define PACKAGE_TARNAME ""
| #define PACKAGE_VERSION ""
| #define PACKAGE_STRING ""
| #define PACKAGE_BUGREPORT ""
| #define PACKAGE "gsdl"
| #define VERSION "2.82-svn"
| #define USE_CORBA 0
| #define MICO_DIR "default"
| #define USE_YAZ $USE_YAZ
| #define ENABLE_ACCENTFOLD $ENABLE_ACCENTFOLD
| #define USE_SQLITE $USE_SQLITE
| #define USE_APACHE_HTTPD $USE_APACHE_HTTPD
| /* end confdefs.h. */
| extern "C" void exit (int);
| #include <stdlib.h>
| int
| main ()
| {
| exit (42);
| ;
| return 0;
| }
configure:2655: g++ -c conftest.cc >&5
./configure: line 2656: g++: command not found
configure:2661: $? = 127
configure: failed program was:
| /* confdefs.h. */
|
| #define PACKAGE_NAME ""
| #define PACKAGE_TARNAME ""
| #define PACKAGE_VERSION ""
| #define PACKAGE_STRING ""
| #define PACKAGE_BUGREPORT ""
| #define PACKAGE "gsdl"
| #define VERSION "2.82-svn"
| #define USE_CORBA 0
| #define MICO_DIR "default"
| #define USE_YAZ $USE_YAZ
| #define ENABLE_ACCENTFOLD $ENABLE_ACCENTFOLD
| #define USE_SQLITE $USE_SQLITE
| #define USE_APACHE_HTTPD $USE_APACHE_HTTPD
| /* end confdefs.h. */
| void exit (int);
| #include <stdlib.h>
| int
| main ()
| {
| exit (42);
| ;
| return 0;
| }
configure:2746: checking for gawk
configure:2762: found /usr/bin/gawk
configure:2772: result: gawk
configure:2786: checking for bison
configure:2815: result: no
configure:2786: checking for byacc
configure:2815: result: no
configure:2854: checking build system type
configure:2872: result: i686-pc-linux-gnu
configure:2880: checking host system type
configure:2894: result: i686-pc-linux-gnu
configure:2902: checking target system type
configure:2916: result: i686-pc-linux-gnu
configure:2943: checking for a BSD-compatible install
configure:2998: result: /usr/bin/install -c
configure:3009: checking whether ln -s works
configure:3013: result: yes
configure:3020: checking whether make sets $(MAKE)
configure:3040: result: yes
configure:3090: checking for ranlib
configure:3106: found /usr/bin/ranlib
configure:3117: result: ranlib
configure:3130: checking to see if architecture is 64-bit
configure:3144: result: no
configure:3192: checking how to run the C preprocessor
configure:3227: gcc -E conftest.c
configure:3233: $? = 0
configure:3265: gcc -E conftest.c
conftest.c:20:28: ac_nonexistent.h: No such file or directory
configure:3271: $? = 1
configure: failed program was:
| /* confdefs.h. */
|
| #define PACKAGE_NAME ""
| #define PACKAGE_TARNAME ""
| #define PACKAGE_VERSION ""
| #define PACKAGE_STRING ""
| #define PACKAGE_BUGREPORT ""
| #define PACKAGE "gsdl"
| #define VERSION "2.82-svn"
| #define USE_CORBA 0
| #define MICO_DIR "default"
| #define USE_YAZ $USE_YAZ
| #define ENABLE_ACCENTFOLD $ENABLE_ACCENTFOLD
| #define USE_SQLITE $USE_SQLITE
| #define USE_APACHE_HTTPD $USE_APACHE_HTTPD
| #ifdef __cplusplus
| void exit (int);
| #endif
| /* end confdefs.h. */
| #include <ac_nonexistent.h>
configure:3310: result: gcc -E
configure:3334: gcc -E conftest.c
configure:3340: $? = 0
configure:3372: gcc -E conftest.c
conftest.c:20:28: ac_nonexistent.h: No such file or directory
configure:3378: $? = 1
configure: failed program was:
| /* confdefs.h. */
|
| #define PACKAGE_NAME ""
| #define PACKAGE_TARNAME ""
| #define PACKAGE_VERSION ""
| #define PACKAGE_STRING ""
| #define PACKAGE_BUGREPORT ""
| #define PACKAGE "gsdl"
| #define VERSION "2.82-svn"
| #define USE_CORBA 0
| #define MICO_DIR "default"
| #define USE_YAZ $USE_YAZ
| #define ENABLE_ACCENTFOLD $ENABLE_ACCENTFOLD
| #define USE_SQLITE $USE_SQLITE
| #define USE_APACHE_HTTPD $USE_APACHE_HTTPD
| #ifdef __cplusplus
| void exit (int);
| #endif
| /* end confdefs.h. */
| #include <ac_nonexistent.h>
configure:3422: checking for egrep
configure:3432: result: grep -E
configure:3438: checking for AIX
configure:3460: result: no
configure:3466: checking for library containing strerror
configure:3496: gcc -o conftest -O2 conftest.c >&5
configure:3502: $? = 0
configure:3506: test -z
|| test ! -s conftest.err
configure:3509: $? = 0
configure:3512: test -s conftest
configure:3515: $? = 0
configure:3585: result: none required
configure:3592: checking for ANSI C header files
configure:3617: gcc -c -O2 conftest.c >&5
configure:3623: $? = 0
configure:3627: test -z
|| test ! -s conftest.err
configure:3630: $? = 0
configure:3633: test -s conftest.o
configure:3636: $? = 0
configure:3725: gcc -o conftest -O2 conftest.c >&5
configure:3728: $? = 0
configure:3730: ./conftest
configure:3733: $? = 0
configure:3748: result: yes
configure:3772: checking for sys/types.h
configure:3788: gcc -c -O2 conftest.c >&5
configure:3794: $? = 0
configure:3798: test -z
|| test ! -s conftest.err
configure:3801: $? = 0
configure:3804: test -s conftest.o
configure:3807: $? = 0
configure:3818: result: yes
configure:3772: checking for sys/stat.h
configure:3788: gcc -c -O2 conftest.c >&5
configure:3794: $? = 0
configure:3798: test -z
|| test ! -s conftest.err
configure:3801: $? = 0
configure:3804: test -s conftest.o
configure:3807: $? = 0
configure:3818: result: yes
configure:3772: checking for stdlib.h
configure:3788: gcc -c -O2 conftest.c >&5
configure:3794: $? = 0
configure:3798: test -z
|| test ! -s conftest.err
configure:3801: $? = 0
configure:3804: test -s conftest.o
configure:3807: $? = 0
configure:3818: result: yes
configure:3772: checking for string.h
configure:3788: gcc -c -O2 conftest.c >&5
configure:3794: $? = 0
configure:3798: test -z
|| test ! -s conftest.err
configure:3801: $? = 0
configure:3804: test -s conftest.o
configure:3807: $? = 0
configure:3818: result: yes
configure:3772: checking for memory.h
configure:3788: gcc -c -O2 conftest.c >&5
configure:3794: $? = 0
configure:3798: test -z
|| test ! -s conftest.err
configure:3801: $? = 0
configure:3804: test -s conftest.o
configure:3807: $? = 0
configure:3818: result: yes
configure:3772: checking for strings.h
configure:3788: gcc -c -O2 conftest.c >&5
configure:3794: $? = 0
configure:3798: test -z
|| test ! -s conftest.err
configure:3801: $? = 0
configure:3804: test -s conftest.o
configure:3807: $? = 0
configure:3818: result: yes
configure:3772: checking for inttypes.h
configure:3788: gcc -c -O2 conftest.c >&5
configure:3794: $? = 0
configure:3798: test -z
|| test ! -s conftest.err
configure:3801: $? = 0
configure:3804: test -s conftest.o
configure:3807: $? = 0
configure:3818: result: yes
configure:3772: checking for stdint.h
configure:3788: gcc -c -O2 conftest.c >&5
configure:3794: $? = 0
configure:3798: test -z
|| test ! -s conftest.err
configure:3801: $? = 0
configure:3804: test -s conftest.o
configure:3807: $? = 0
configure:3818: result: yes
configure:3772: checking for unistd.h
configure:3788: gcc -c -O2 conftest.c >&5
configure:3794: $? = 0
configure:3798: test -z
|| test ! -s conftest.err
configure:3801: $? = 0
configure:3804: test -s conftest.o
configure:3807: $? = 0
configure:3818: result: yes
configure:3840: checking minix/config.h usability
configure:3852: gcc -c -O2 conftest.c >&5
conftest.c:64:26: minix/config.h: No such file or directory
configure:3858: $? = 1
configure: failed program was:
| /* confdefs.h. */
|
| #define PACKAGE_NAME ""
| #define PACKAGE_TARNAME ""
| #define PACKAGE_VERSION ""
| #define PACKAGE_STRING ""
| #define PACKAGE_BUGREPORT ""
| #define PACKAGE "gsdl"
| #define VERSION "2.82-svn"
| #define USE_CORBA 0
| #define MICO_DIR "default"
| #define USE_YAZ $USE_YAZ
| #define ENABLE_ACCENTFOLD $ENABLE_ACCENTFOLD
| #define USE_SQLITE $USE_SQLITE
| #define USE_APACHE_HTTPD $USE_APACHE_HTTPD
| #ifdef __cplusplus
| void exit (int);
| #endif
| #define STDC_HEADERS 1
| #define HAVE_SYS_TYPES_H 1
| #define HAVE_SYS_STAT_H 1
| #define HAVE_STDLIB_H 1
| #define HAVE_STRING_H 1
| #define HAVE_MEMORY_H 1
| #define HAVE_STRINGS_H 1
| #define HAVE_INTTYPES_H 1
| #define HAVE_STDINT_H 1
| #define HAVE_UNISTD_H 1
| /* end confdefs.h. */
| #include <stdio.h>
| #if HAVE_SYS_TYPES_H
| # include <sys/types.h>
| #endif
| #if HAVE_SYS_STAT_H
| # include <sys/stat.h>
| #endif
| #if STDC_HEADERS
| # include <stdlib.h>
| # include <stddef.h>
| #else
| # if HAVE_STDLIB_H
| # include <stdlib.h>
| # endif
| #endif
| #if HAVE_STRING_H
| # if !STDC_HEADERS && HAVE_MEMORY_H
| # include <memory.h>
| # endif
| # include <string.h>
| #endif
| #if HAVE_STRINGS_H
| # include <strings.h>
| #endif
| #if HAVE_INTTYPES_H
| # include <inttypes.h>
| #else
| # if HAVE_STDINT_H
| # include <stdint.h>
| # endif
| #endif
| #if HAVE_UNISTD_H
| # include <unistd.h>
| #endif
| #include <minix/config.h>
configure:3881: result: no
configure:3885: checking minix/config.h presence
configure:3895: gcc -E conftest.c
conftest.c:30:26: minix/config.h: No such file or directory
configure:3901: $? = 1
configure: failed program was:
| /* confdefs.h. */
|
| #define PACKAGE_NAME ""
| #define PACKAGE_TARNAME ""
| #define PACKAGE_VERSION ""
| #define PACKAGE_STRING ""
| #define PACKAGE_BUGREPORT ""
| #define PACKAGE "gsdl"
| #define VERSION "2.82-svn"
| #define USE_CORBA 0
| #define MICO_DIR "default"
| #define USE_YAZ $USE_YAZ
| #define ENABLE_ACCENTFOLD $ENABLE_ACCENTFOLD
| #define USE_SQLITE $USE_SQLITE
| #define USE_APACHE_HTTPD $USE_APACHE_HTTPD
| #ifdef __cplusplus
| void exit (int);
| #endif
| #define STDC_HEADERS 1
| #define HAVE_SYS_TYPES_H 1
| #define HAVE_SYS_STAT_H 1
| #define HAVE_STDLIB_H 1
| #define HAVE_STRING_H 1
| #define HAVE_MEMORY_H 1
| #define HAVE_STRINGS_H 1
| #define HAVE_INTTYPES_H 1
| #define HAVE_STDINT_H 1
| #define HAVE_UNISTD_H 1
| /* end confdefs.h. */
| #include <minix/config.h>
configure:3921: result: no
configure:3956: checking for minix/config.h
configure:3963: result: no
configure:3992: checking for gcc option to accept ANSI C
configure:4062: result:
configure:4070: checking for function prototypes
configure:4073: result: yes
configure:4086: checking for an ANSI C-conforming const
configure:4153: gcc -c -O2 conftest.c >&5
configure:4159: $? = 0
configure:4163: test -z
|| test ! -s conftest.err
configure:4166: $? = 0
configure:4169: test -s conftest.o
configure:4172: $? = 0
configure:4183: result: yes
configure:4193: checking for off_t
configure:4217: gcc -c -O2 conftest.c >&5
configure:4223: $? = 0
configure:4227: test -z
|| test ! -s conftest.err
configure:4230: $? = 0
configure:4233: test -s conftest.o
configure:4236: $? = 0
configure:4247: result: yes
configure:4259: checking for size_t
configure:4283: gcc -c -O2 conftest.c >&5
configure:4289: $? = 0
configure:4293: test -z
|| test ! -s conftest.err
configure:4296: $? = 0
configure:4299: test -s conftest.o
configure:4302: $? = 0
configure:4313: result: yes
configure:4325: checking whether time.h and sys/time.h may both be included
configure:4350: gcc -c -O2 conftest.c >&5
configure:4356: $? = 0
configure:4360: test -z
|| test ! -s conftest.err
configure:4363: $? = 0
configure:4366: test -s conftest.o
configure:4369: $? = 0
configure:4380: result: yes
configure:4390: checking whether struct tm is in sys/time.h or time.h
configure:4413: gcc -c -O2 conftest.c >&5
configure:4419: $? = 0
configure:4423: test -z
|| test ! -s conftest.err
configure:4426: $? = 0
configure:4429: test -s conftest.o
configure:4432: $? = 0
configure:4443: result: time.h
configure:4505: checking for main in -lg
configure:4529: gcc -o conftest -O2 conftest.c -lg >&5
configure:4535: $? = 0
configure:4539: test -z
|| test ! -s conftest.err
configure:4542: $? = 0
configure:4545: test -s conftest
configure:4548: $? = 0
configure:4561: result: yes
configure:4574: checking for main in -lm
configure:4598: gcc -o conftest -O2 conftest.c -lm -lg >&5
configure:4604: $? = 0
configure:4608: test -z
|| test ! -s conftest.err
configure:4611: $? = 0
configure:4614: test -s conftest
configure:4617: $? = 0
configure:4630: result: yes
configure:4643: checking for main in -lcrypt
configure:4667: gcc -o conftest -O2 conftest.c -lcrypt -lm -lg >&5
configure:4673: $? = 0
configure:4677: test -z
|| test ! -s conftest.err
configure:4680: $? = 0
configure:4683: test -s conftest
configure:4686: $? = 0
configure:4699: result: yes
configure:4723: checking for dirent.h that defines DIR
configure:4747: gcc -c -O2 conftest.c >&5
configure:4753: $? = 0
configure:4757: test -z
|| test ! -s conftest.err
configure:4760: $? = 0
configure:4763: test -s conftest.o
configure:4766: $? = 0
configure:4777: result: yes
configure:4790: checking for library containing opendir
configure:4820: gcc -o conftest -O2 conftest.c -lcrypt -lm -lg >&5
configure:4826: $? = 0
configure:4830: test -z
|| test ! -s conftest.err
configure:4833: $? = 0
configure:4836: test -s conftest
configure:4839: $? = 0
configure:4909: result: none required
configure:5045: checking for ANSI C header files
configure:5201: result: yes
configure:5233: checking fcntl.h usability
configure:5245: gcc -c -O2 conftest.c >&5
configure:5251: $? = 0
configure:5255: test -z
|| test ! -s conftest.err
configure:5258: $? = 0
configure:5261: test -s conftest.o
configure:5264: $? = 0
configure:5274: result: yes
configure:5278: checking fcntl.h presence
configure:5288: gcc -E conftest.c
configure:5294: $? = 0
configure:5314: result: yes
configure:5349: checking for fcntl.h
configure:5356: result: yes
configure:5233: checking limits.h usability
configure:5245: gcc -c -O2 conftest.c >&5
configure:5251: $? = 0
configure:5255: test -z
|| test ! -s conftest.err
configure:5258: $? = 0
configure:5261: test -s conftest.o
configure:5264: $? = 0
configure:5274: result: yes
configure:5278: checking limits.h presence
configure:5288: gcc -E conftest.c
configure:5294: $? = 0
configure:5314: result: yes
configure:5349: checking for limits.h
configure:5356: result: yes
configure:5233: checking sys/time.h usability
configure:5245: gcc -c -O2 conftest.c >&5
configure:5251: $? = 0
configure:5255: test -z
|| test ! -s conftest.err
configure:5258: $? = 0
configure:5261: test -s conftest.o
configure:5264: $? = 0
configure:5274: result: yes
configure:5278: checking sys/time.h presence
configure:5288: gcc -E conftest.c
configure:5294: $? = 0
configure:5314: result: yes
configure:5349: checking for sys/time.h
configure:5356: result: yes
configure:5224: checking for unistd.h
configure:5229: result: yes
configure:5233: checking crypt.h usability
configure:5245: gcc -c -O2 conftest.c >&5
configure:5251: $? = 0
configure:5255: test -z
|| test ! -s conftest.err
configure:5258: $? = 0
configure:5261: test -s conftest.o
configure:5264: $? = 0
configure:5274: result: yes
configure:5278: checking crypt.h presence
configure:5288: gcc -E conftest.c
configure:5294: $? = 0
configure:5314: result: yes
configure:5349: checking for crypt.h
configure:5356: result: yes
configure:5224: checking for string.h
configure:5229: result: yes
configure:5224: checking for memory.h
configure:5229: result: yes
configure:5233: checking sys/procfs.h usability
configure:5245: gcc -c -O2 conftest.c >&5
configure:5251: $? = 0
configure:5255: test -z
|| test ! -s conftest.err
configure:5258: $? = 0
configure:5261: test -s conftest.o
configure:5264: $? = 0
configure:5274: result: yes
configure:5278: checking sys/procfs.h presence
configure:5288: gcc -E conftest.c
configure:5294: $? = 0
configure:5314: result: yes
configure:5349: checking for sys/procfs.h
configure:5356: result: yes
configure:5224: checking for sys/stat.h
configure:5229: result: yes
configure:5426: checking for working alloca.h
configure:5447: gcc -o conftest -O2 conftest.c -lcrypt -lm -lg >&5
configure:5453: $? = 0
configure:5457: test -z
|| test ! -s conftest.err
configure:5460: $? = 0
configure:5463: test -s conftest
configure:5466: $? = 0
configure:5478: result: yes
configure:5488: checking for alloca
configure:5529: gcc -o conftest -O2 conftest.c -lcrypt -lm -lg >&5
configure:5535: $? = 0
configure:5539: test -z
|| test ! -s conftest.err
configure:5542: $? = 0
configure:5545: test -s conftest
configure:5548: $? = 0
configure:5560: result: yes
configure:5784: checking whether gcc needs -traditional
configure:5826: result: no
configure:5833: checking return type of signal handlers
configure:5864: gcc -c -O2 conftest.c >&5
configure:5870: $? = 0
configure:5874: test -z
|| test ! -s conftest.err
configure:5877: $? = 0
configure:5880: test -s conftest.o
configure:5883: $? = 0
configure:5894: result: void
configure:5906: checking for vprintf
configure:5963: gcc -o conftest -O2 conftest.c -lcrypt -lm -lg >&5
conftest.c:75: warning: conflicting types for built-in function 'vprintf'
configure:5969: $? = 0
configure:5973: test -z
|| test ! -s conftest.err
configure:5976: $? = 0
configure:5979: test -s conftest
configure:5982: $? = 0
configure:5994: result: yes
configure:6001: checking for _doprnt
configure:6058: gcc -o conftest -O2 conftest.c -lcrypt -lm -lg >&5
/tmp/cc2AZ9RF.o(.text+0x14): In function `main':
: undefined reference to `_doprnt'
/tmp/cc2AZ9RF.o(.data+0x0): undefined reference to `_doprnt'
collect2: ld returned 1 exit status
configure:6064: $? = 1
configure: failed program was:
| /* confdefs.h. */
|
| #define PACKAGE_NAME ""
| #define PACKAGE_TARNAME ""
| #define PACKAGE_VERSION ""
| #define PACKAGE_STRING ""
| #define PACKAGE_BUGREPORT ""
| #define PACKAGE "gsdl"
| #define VERSION "2.82-svn"
| #define USE_CORBA 0
| #define MICO_DIR "default"
| #define USE_YAZ $USE_YAZ
| #define ENABLE_ACCENTFOLD $ENABLE_ACCENTFOLD
| #define USE_SQLITE $USE_SQLITE
| #define USE_APACHE_HTTPD $USE_APACHE_HTTPD
| #ifdef __cplusplus
| void exit (int);
| #endif
| #define STDC_HEADERS 1
| #define HAVE_SYS_TYPES_H 1
| #define HAVE_SYS_STAT_H 1
| #define HAVE_STDLIB_H 1
| #define HAVE_STRING_H 1
| #define HAVE_MEMORY_H 1
| #define HAVE_STRINGS_H 1
| #define HAVE_INTTYPES_H 1
| #define HAVE_STDINT_H 1
| #define HAVE_UNISTD_H 1
| #define PROTOTYPES 1
| #define TIME_WITH_SYS_TIME 1
| #define HAVE_LIBG 1
| #define HAVE_LIBM 1
| #define HAVE_LIBCRYPT 1
| #define HAVE_DIRENT_H 1
| #define STDC_HEADERS 1
| #define HAVE_FCNTL_H 1
| #define HAVE_LIMITS_H 1
| #define HAVE_SYS_TIME_H 1
| #define HAVE_UNISTD_H 1
| #define HAVE_CRYPT_H 1
| #define HAVE_STRING_H 1
| #define HAVE_MEMORY_H 1
| #define HAVE_SYS_PROCFS_H 1
| #define HAVE_SYS_STAT_H 1
| #define HAVE_FREAD_DECL 1
| #define HAVE_FGETC_DECL 1
| #define HAVE_ALLOCA_H 1
| #define HAVE_ALLOCA 1
| #define RETSIGTYPE void
| #define HAVE_VPRINTF 1
| /* end confdefs.h. */
| /* Define _doprnt to an innocuous variant, in case <limits.h> declares _doprnt.
| For example, HP-UX 11i <limits.h> declares gettimeofday. */
| #define _doprnt innocuous__doprnt
|
| /* System header to define __stub macros and hopefully few prototypes,
| which can conflict with char _doprnt (); below.
| Prefer <limits.h> to <assert.h> if __STDC__ is defined, since
| <limits.h> exists even on freestanding compilers. */
|
| #ifdef __STDC__
| # include <limits.h>
| #else
| # include <assert.h>
| #endif
|
| #undef _doprnt
|
| /* Override any gcc2 internal prototype to avoid an error. */
| #ifdef __cplusplus
| extern "C"
| {
| #endif
| /* We use char because int might match the return type of a gcc2
| builtin and then its argument prototype would still apply. */
| char _doprnt ();
| /* The GNU C library defines this for functions which it implements
| to always fail with ENOSYS. Some functions are actually named
| something starting with __ and the normal name is an alias. */
| #if defined (__stub__doprnt) || defined (__stub____doprnt)
| choke me
| #else
| char (*f) () = _doprnt;
| #endif
| #ifdef __cplusplus
| }
| #endif
|
| int
| main ()
| {
| return f != _doprnt;
| ;
| return 0;
| }
configure:6089: result: no
configure:6116: checking for ftime
configure:6173: gcc -o conftest -O2 conftest.c -lcrypt -lm -lg >&5
configure:6179: $? = 0
configure:6183: test -z
|| test ! -s conftest.err
configure:6186: $? = 0
configure:6189: test -s conftest
configure:6192: $? = 0
configure:6204: result: yes
configure:6116: checking for select
configure:6173: gcc -o conftest -O2 conftest.c -lcrypt -lm -lg >&5
configure:6179: $? = 0
configure:6183: test -z
|| test ! -s conftest.err
configure:6186: $? = 0
configure:6189: test -s conftest
configure:6192: $? = 0
configure:6204: result: yes
configure:6116: checking for strftime
configure:6173: gcc -o conftest -O2 conftest.c -lcrypt -lm -lg >&5
conftest.c:78: warning: conflicting types for built-in function 'strftime'
configure:6179: $? = 0
configure:6183: test -z
|| test ! -s conftest.err
configure:6186: $? = 0
configure:6189: test -s conftest
configure:6192: $? = 0
configure:6204: result: yes
configure:6116: checking for strtol
configure:6173: gcc -o conftest -O2 conftest.c -lcrypt -lm -lg >&5
configure:6179: $? = 0
configure:6183: test -z
|| test ! -s conftest.err
configure:6186: $? = 0
configure:6189: test -s conftest
configure:6192: $? = 0
configure:6204: result: yes
configure:6116: checking for getrusage
configure:6173: gcc -o conftest -O2 conftest.c -lcrypt -lm -lg >&5
configure:6179: $? = 0
configure:6183: test -z
|| test ! -s conftest.err
configure:6186: $? = 0
configure:6189: test -s conftest
configure:6192: $? = 0
configure:6204: result: yes
configure:6116: checking for times
configure:6173: gcc -o conftest -O2 conftest.c -lcrypt -lm -lg >&5
configure:6179: $? = 0
configure:6183: test -z
|| test ! -s conftest.err
configure:6186: $? = 0
configure:6189: test -s conftest
configure:6192: $? = 0
configure:6204: result: yes
configure:6116: checking for mallinfo
configure:6173: gcc -o conftest -O2 conftest.c -lcrypt -lm -lg >&5
configure:6179: $? = 0
configure:6183: test -z
|| test ! -s conftest.err
configure:6186: $? = 0
configure:6189: test -s conftest
configure:6192: $? = 0
configure:6204: result: yes
configure:6116: checking for setbuffer
configure:6173: gcc -o conftest -O2 conftest.c -lcrypt -lm -lg >&5
configure:6179: $? = 0
configure:6183: test -z
|| test ! -s conftest.err
configure:6186: $? = 0
configure:6189: test -s conftest
configure:6192: $? = 0
configure:6204: result: yes
configure:6116: checking for getpagesize
configure:6173: gcc -o conftest -O2 conftest.c -lcrypt -lm -lg >&5
configure:6179: $? = 0
configure:6183: test -z
|| test ! -s conftest.err
configure:6186: $? = 0
configure:6189: test -s conftest
configure:6192: $? = 0
configure:6204: result: yes
configure:6116: checking for strerror
configure:6173: gcc -o conftest -O2 conftest.c -lcrypt -lm -lg >&5
configure:6179: $? = 0
configure:6183: test -z
|| test ! -s conftest.err
configure:6186: $? = 0
configure:6189: test -s conftest
configure:6192: $? = 0
configure:6204: result: yes
configure:6220: checking for ftruncate
configure:6277: gcc -o conftest -O2 conftest.c -lcrypt -lm -lg >&5
configure:6283: $? = 0
configure:6287: test -z
|| test ! -s conftest.err
configure:6290: $? = 0
configure:6293: test -s conftest
configure:6296: $? = 0
configure:6308: result: yes
configure:6220: checking for strstr
configure:6277: gcc -o conftest -O2 conftest.c -lcrypt -lm -lg >&5
conftest.c:87: warning: conflicting types for built-in function 'strstr'
configure:6283: $? = 0
configure:6287: test -z
|| test ! -s conftest.err
configure:6290: $? = 0
configure:6293: test -s conftest
configure:6296: $? = 0
configure:6308: result: yes
configure:6220: checking for strcasecmp
configure:6277: gcc -o conftest -O2 conftest.c -lcrypt -lm -lg >&5
configure:6283: $? = 0
configure:6287: test -z
|| test ! -s conftest.err
configure:6290: $? = 0
configure:6293: test -s conftest
configure:6296: $? = 0
configure:6308: result: yes
configure:6329: checking for textdomain
configure:6386: gcc -o conftest -O2 conftest.c -lcrypt -lm -lg >&5
configure:6392: $? = 0
configure:6396: test -z
|| test ! -s conftest.err
configure:6399: $? = 0
configure:6402: test -s conftest
configure:6405: $? = 0
configure:6417: result: yes
configure:6429: checking for HP-UX needing gmalloc
configure:6447: result: no
configure:6453: checking for valloc
configure:6510: gcc -o conftest -O2 conftest.c -lcrypt -lm -lg >&5
configure:6516: $? = 0
configure:6520: test -z
|| test ! -s conftest.err
configure:6523: $? = 0
configure:6526: test -s conftest
configure:6529: $? = 0
configure:6541: result: yes
configure:6554: checking for Apple MacOS X/Darwin
configure:6561: result: no
configure:6567: checking if malloc debugging is wanted
configure:6587: result: no
configure:6591: checking which of rx or regex is wanted
configure:6616: result: rx
configure:6618: checking for re_rx_search
configure:6675: gcc -o conftest -O2 conftest.c -lcrypt -lm -lg >&5
/tmp/ccWbT8Mg.o(.text+0x14): In function `main':
: undefined reference to `re_rx_search'
/tmp/ccWbT8Mg.o(.data+0x0): undefined reference to `re_rx_search'
collect2: ld returned 1 exit status
configure:6681: $? = 1
configure: failed program was:
| /* confdefs.h. */
|
| #define PACKAGE_NAME ""
| #define PACKAGE_TARNAME ""
| #define PACKAGE_VERSION ""
| #define PACKAGE_STRING ""
| #define PACKAGE_BUGREPORT ""
| #define PACKAGE "gsdl"
| #define VERSION "2.82-svn"
| #define USE_CORBA 0
| #define MICO_DIR "default"
| #define USE_YAZ $USE_YAZ
| #define ENABLE_ACCENTFOLD $ENABLE_ACCENTFOLD
| #define USE_SQLITE $USE_SQLITE
| #define USE_APACHE_HTTPD $USE_APACHE_HTTPD
| #ifdef __cplusplus
| void exit (int);
| #endif
| #define STDC_HEADERS 1
| #define HAVE_SYS_TYPES_H 1
| #define HAVE_SYS_STAT_H 1
| #define HAVE_STDLIB_H 1
| #define HAVE_STRING_H 1
| #define HAVE_MEMORY_H 1
| #define HAVE_STRINGS_H 1
| #define HAVE_INTTYPES_H 1
| #define HAVE_STDINT_H 1
| #define HAVE_UNISTD_H 1
| #define PROTOTYPES 1
| #define TIME_WITH_SYS_TIME 1
| #define HAVE_LIBG 1
| #define HAVE_LIBM 1
| #define HAVE_LIBCRYPT 1
| #define HAVE_DIRENT_H 1
| #define STDC_HEADERS 1
| #define HAVE_FCNTL_H 1
| #define HAVE_LIMITS_H 1
| #define HAVE_SYS_TIME_H 1
| #define HAVE_UNISTD_H 1
| #define HAVE_CRYPT_H 1
| #define HAVE_STRING_H 1
| #define HAVE_MEMORY_H 1
| #define HAVE_SYS_PROCFS_H 1
| #define HAVE_SYS_STAT_H 1
| #define HAVE_FREAD_DECL 1
| #define HAVE_FGETC_DECL 1
| #define HAVE_ALLOCA_H 1
| #define HAVE_ALLOCA 1
| #define RETSIGTYPE void
| #define HAVE_VPRINTF 1
| #define HAVE_FTIME 1
| #define HAVE_SELECT 1
| #define HAVE_STRFTIME 1
| #define HAVE_STRTOL 1
| #define HAVE_GETRUSAGE 1
| #define HAVE_TIMES 1
| #define HAVE_MALLINFO 1
| #define HAVE_SETBUFFER 1
| #define HAVE_GETPAGESIZE 1
| #define HAVE_STRERROR 1
| #define HAVE_FTRUNCATE 1
| #define HAVE_STRSTR 1
| #define HAVE_STRCASECMP 1
| #define ENABLE_NLS 1
| #define HAVE_VALLOC 1
| /* end confdefs.h. */
| /* Define re_rx_search to an innocuous variant, in case <limits.h> declares re_rx_search.
| For example, HP-UX 11i <limits.h> declares gettimeofday. */
| #define re_rx_search innocuous_re_rx_search
|
| /* System header to define __stub macros and hopefully few prototypes,
| which can conflict with char re_rx_search (); below.
| Prefer <limits.h> to <assert.h> if __STDC__ is defined, since
| <limits.h> exists even on freestanding compilers. */
|
| #ifdef __STDC__
| # include <limits.h>
| #else
| # include <assert.h>
| #endif
|
| #undef re_rx_search
|
| /* Override any gcc2 internal prototype to avoid an error. */
| #ifdef __cplusplus
| extern "C"
| {
| #endif
| /* We use char because int might match the return type of a gcc2
| builtin and then its argument prototype would still apply. */
| char re_rx_search ();
| /* The GNU C library defines this for functions which it implements
| to always fail with ENOSYS. Some functions are actually named
| something starting with __ and the normal name is an alias. */
| #if defined (__stub_re_rx_search) || defined (__stub___re_rx_search)
| choke me
| #else
| char (*f) () = re_rx_search;
| #endif
| #ifdef __cplusplus
| }
| #endif
|
| int
| main ()
| {
| return f != re_rx_search;
| ;
| return 0;
| }
configure:6706: result: no
configure:6754: checking that Perl 5 is available
configure:6772: result: "yes"
configure:6788: checking "whether STL library has known faults"
configure:6809: g++ -c conftest.cc >&5
./configure: line 6810: g++: command not found
configure:6815: $? = 127
configure: failed program was:
| /* confdefs.h. */
|
| #define PACKAGE_NAME ""
| #define PACKAGE_TARNAME ""
| #define PACKAGE_VERSION ""
| #define PACKAGE_STRING ""
| #define PACKAGE_BUGREPORT ""
| #define PACKAGE "gsdl"
| #define VERSION "2.82-svn"
| #define USE_CORBA 0
| #define MICO_DIR "default"
| #define USE_YAZ $USE_YAZ
| #define ENABLE_ACCENTFOLD $ENABLE_ACCENTFOLD
| #define USE_SQLITE $USE_SQLITE
| #define USE_APACHE_HTTPD $USE_APACHE_HTTPD
| #ifdef __cplusplus
| void exit (int);
| #endif
| #define STDC_HEADERS 1
| #define HAVE_SYS_TYPES_H 1
| #define HAVE_SYS_STAT_H 1
| #define HAVE_STDLIB_H 1
| #define HAVE_STRING_H 1
| #define HAVE_MEMORY_H 1
| #define HAVE_STRINGS_H 1
| #define HAVE_INTTYPES_H 1
| #define HAVE_STDINT_H 1
| #define HAVE_UNISTD_H 1
| #define PROTOTYPES 1
| #define TIME_WITH_SYS_TIME 1
| #define HAVE_LIBG 1
| #define HAVE_LIBM 1
| #define HAVE_LIBCRYPT 1
| #define HAVE_DIRENT_H 1
| #define STDC_HEADERS 1
| #define HAVE_FCNTL_H 1
| #define HAVE_LIMITS_H 1
| #define HAVE_SYS_TIME_H 1
| #define HAVE_UNISTD_H 1
| #define HAVE_CRYPT_H 1
| #define HAVE_STRING_H 1
| #define HAVE_MEMORY_H 1
| #define HAVE_SYS_PROCFS_H 1
| #define HAVE_SYS_STAT_H 1
| #define HAVE_FREAD_DECL 1
| #define HAVE_FGETC_DECL 1
| #define HAVE_ALLOCA_H 1
| #define HAVE_ALLOCA 1
| #define RETSIGTYPE void
| #define HAVE_VPRINTF 1
| #define HAVE_FTIME 1
| #define HAVE_SELECT 1
| #define HAVE_STRFTIME 1
| #define HAVE_STRTOL 1
| #define HAVE_GETRUSAGE 1
| #define HAVE_TIMES 1
| #define HAVE_MALLINFO 1
| #define HAVE_SETBUFFER 1
| #define HAVE_GETPAGESIZE 1
| #define HAVE_STRERROR 1
| #define HAVE_FTRUNCATE 1
| #define HAVE_STRSTR 1
| #define HAVE_STRCASECMP 1
| #define ENABLE_NLS 1
| #define HAVE_VALLOC 1
| /* end confdefs.h. */
| #include <vector>
|
| int
| main ()
| {
|
| ;
| return 0;
| }
configure:6856: g++ -c conftest.cc >&5
./configure: line 6857: g++: command not found
configure:6862: $? = 127
configure: failed program was:
| /* confdefs.h. */
|
| #define PACKAGE_NAME ""
| #define PACKAGE_TARNAME ""
| #define PACKAGE_VERSION ""
| #define PACKAGE_STRING ""
| #define PACKAGE_BUGREPORT ""
| #define PACKAGE "gsdl"
| #define VERSION "2.82-svn"
| #define USE_CORBA 0
| #define MICO_DIR "default"
| #define USE_YAZ $USE_YAZ
| #define ENABLE_ACCENTFOLD $ENABLE_ACCENTFOLD
| #define USE_SQLITE $USE_SQLITE
| #define USE_APACHE_HTTPD $USE_APACHE_HTTPD
| #ifdef __cplusplus
| void exit (int);
| #endif
| #define STDC_HEADERS 1
| #define HAVE_SYS_TYPES_H 1
| #define HAVE_SYS_STAT_H 1
| #define HAVE_STDLIB_H 1
| #define HAVE_STRING_H 1
| #define HAVE_MEMORY_H 1
| #define HAVE_STRINGS_H 1
| #define HAVE_INTTYPES_H 1
| #define HAVE_STDINT_H 1
| #define HAVE_UNISTD_H 1
| #define PROTOTYPES 1
| #define TIME_WITH_SYS_TIME 1
| #define HAVE_LIBG 1
| #define HAVE_LIBM 1
| #define HAVE_LIBCRYPT 1
| #define HAVE_DIRENT_H 1
| #define STDC_HEADERS 1
| #define HAVE_FCNTL_H 1
| #define HAVE_LIMITS_H 1
| #define HAVE_SYS_TIME_H 1
| #define HAVE_UNISTD_H 1
| #define HAVE_CRYPT_H 1
| #define HAVE_STRING_H 1
| #define HAVE_MEMORY_H 1
| #define HAVE_SYS_PROCFS_H 1
| #define HAVE_SYS_STAT_H 1
| #define HAVE_FREAD_DECL 1
| #define HAVE_FGETC_DECL 1
| #define HAVE_ALLOCA_H 1
| #define HAVE_ALLOCA 1
| #define RETSIGTYPE void
| #define HAVE_VPRINTF 1
| #define HAVE_FTIME 1
| #define HAVE_SELECT 1
| #define HAVE_STRFTIME 1
| #define HAVE_STRTOL 1
| #define HAVE_GETRUSAGE 1
| #define HAVE_TIMES 1
| #define HAVE_MALLINFO 1
| #define HAVE_SETBUFFER 1
| #define HAVE_GETPAGESIZE 1
| #define HAVE_STRERROR 1
| #define HAVE_FTRUNCATE 1
| #define HAVE_STRSTR 1
| #define HAVE_STRCASECMP 1
| #define ENABLE_NLS 1
| #define HAVE_VALLOC 1
| /* end confdefs.h. */
| #include <vector.h>
|
| int
| main ()
| {
|
| ;
| return 0;
| }
configure:6904: g++ -c conftest.cc >&5
./configure: line 6905: g++: command not found
configure:6910: $? = 127
configure: failed program was:
| /* confdefs.h. */
|
| #define PACKAGE_NAME ""
| #define PACKAGE_TARNAME ""
| #define PACKAGE_VERSION ""
| #define PACKAGE_STRING ""
| #define PACKAGE_BUGREPORT ""
| #define PACKAGE "gsdl"
| #define VERSION "2.82-svn"
| #define USE_CORBA 0
| #define MICO_DIR "default"
| #define USE_YAZ $USE_YAZ
| #define ENABLE_ACCENTFOLD $ENABLE_ACCENTFOLD
| #define USE_SQLITE $USE_SQLITE
| #define USE_APACHE_HTTPD $USE_APACHE_HTTPD
| #ifdef __cplusplus
| void exit (int);
| #endif
| #define STDC_HEADERS 1
| #define HAVE_SYS_TYPES_H 1
| #define HAVE_SYS_STAT_H 1
| #define HAVE_STDLIB_H 1
| #define HAVE_STRING_H 1
| #define HAVE_MEMORY_H 1
| #define HAVE_STRINGS_H 1
| #define HAVE_INTTYPES_H 1
| #define HAVE_STDINT_H 1
| #define HAVE_UNISTD_H 1
| #define PROTOTYPES 1
| #define TIME_WITH_SYS_TIME 1
| #define HAVE_LIBG 1
| #define HAVE_LIBM 1
| #define HAVE_LIBCRYPT 1
| #define HAVE_DIRENT_H 1
| #define STDC_HEADERS 1
| #define HAVE_FCNTL_H 1
| #define HAVE_LIMITS_H 1
| #define HAVE_SYS_TIME_H 1
| #define HAVE_UNISTD_H 1
| #define HAVE_CRYPT_H 1
| #define HAVE_STRING_H 1
| #define HAVE_MEMORY_H 1
| #define HAVE_SYS_PROCFS_H 1
| #define HAVE_SYS_STAT_H 1
| #define HAVE_FREAD_DECL 1
| #define HAVE_FGETC_DECL 1
| #define HAVE_ALLOCA_H 1
| #define HAVE_ALLOCA 1
| #define RETSIGTYPE void
| #define HAVE_VPRINTF 1
| #define HAVE_FTIME 1
| #define HAVE_SELECT 1
| #define HAVE_STRFTIME 1
| #define HAVE_STRTOL 1
| #define HAVE_GETRUSAGE 1
| #define HAVE_TIMES 1
| #define HAVE_MALLINFO 1
| #define HAVE_SETBUFFER 1
| #define HAVE_GETPAGESIZE 1
| #define HAVE_STRERROR 1
| #define HAVE_FTRUNCATE 1
| #define HAVE_STRSTR 1
| #define HAVE_STRCASECMP 1
| #define ENABLE_NLS 1
| #define HAVE_VALLOC 1
| /* end confdefs.h. */
| #include <ospacestdvector>
|
| int
| main ()
| {
|
| ;
| return 0;
| }
configure:6938: result: "yes"
configure:6940: error: "STL Broken - Obtain newer version of GNU C Compiler"

## ---------------- ##
## Cache variables. ##
## ---------------- ##

ac_cv_build=i686-pc-linux-gnu
ac_cv_build_alias=i686-pc-linux-gnu
ac_cv_c_compiler_gnu=yes
ac_cv_c_const=yes
ac_cv_cxx_compiler_gnu=no
ac_cv_env_CC_set=
ac_cv_env_CC_value=
ac_cv_env_CFLAGS_set=
ac_cv_env_CFLAGS_value=
ac_cv_env_CPPFLAGS_set=
ac_cv_env_CPPFLAGS_value=
ac_cv_env_CPP_set=
ac_cv_env_CPP_value=
ac_cv_env_CXXFLAGS_set=
ac_cv_env_CXXFLAGS_value=
ac_cv_env_CXX_set=
ac_cv_env_CXX_value=
ac_cv_env_LDFLAGS_set=
ac_cv_env_LDFLAGS_value=
ac_cv_env_build_alias_set=
ac_cv_env_build_alias_value=
ac_cv_env_host_alias_set=
ac_cv_env_host_alias_value=
ac_cv_env_target_alias_set=
ac_cv_env_target_alias_value=
ac_cv_exeext=
ac_cv_func__doprnt=no
ac_cv_func_alloca_works=yes
ac_cv_func_ftime=yes
ac_cv_func_ftruncate=yes
ac_cv_func_getpagesize=yes
ac_cv_func_getrusage=yes
ac_cv_func_mallinfo=yes
ac_cv_func_re_rx_search=no
ac_cv_func_select=yes
ac_cv_func_setbuffer=yes
ac_cv_func_strcasecmp=yes
ac_cv_func_strerror=yes
ac_cv_func_strftime=yes
ac_cv_func_strstr=yes
ac_cv_func_strtol=yes
ac_cv_func_textdomain=yes
ac_cv_func_times=yes
ac_cv_func_valloc=yes
ac_cv_func_vprintf=yes
ac_cv GSDL Error

crypt_h=yes
ac_cv GSDL Error
dirent_dirent_h=yes
ac_cv GSDL Error
fcntl_h=yes
ac_cv GSDL Error
inttypes_h=yes
ac_cv GSDL Error
limits_h=yes
ac_cv GSDL Error
memory_h=yes
ac_cv GSDL Error
minix_config_h=no
ac_cv GSDL Error
stdc=yes
ac_cv GSDL Error
stdint_h=yes
ac_cv GSDL Error
stdlib_h=yes
ac_cv GSDL Error
string_h=yes
ac_cv GSDL Error
strings_h=yes
ac_cv GSDL Error
sys_procfs_h=yes
ac_cv GSDL Error
sys_stat_h=yes
ac_cv GSDL Error
sys_time_h=yes
ac_cv GSDL Error
sys_types_h=yes
ac_cv GSDL Error
time=yes
ac_cv GSDL Error
unistd_h=yes
ac_cv_host=i686-pc-linux-gnu
ac_cv_host_alias=i686-pc-linux-gnu
ac_cv_lib_crypt=ac_cv_lib_crypt_main
ac_cv_lib_crypt_main=yes
ac_cv_lib_g=ac_cv_lib_g_main
ac_cv_lib_g_main=yes
ac_cv_lib_m=ac_cv_lib_m_main
ac_cv_lib_m_main=yes
ac_cv_objext=o
ac_cv_path_install='/usr/bin/install -c'
ac_cv_prog_AWK=gawk
ac_cv_prog_CPP='gcc -E'
ac_cv_prog_ac_ct_CC=gcc
ac_cv_prog_ac_ct_RANLIB=ranlib
ac_cv_prog_cc_g=yes
ac_cv_prog_cc_stdc=
ac_cv_prog_cxx_g=no
ac_cv_prog_egrep='grep -E'
ac_cv_prog_gcc_traditional=no
ac_cv_prog_make_make_set=yes
ac_cv_search_opendir='none required'
ac_cv_search_strerror='none required'
ac_cv_struct_tm=time.h
ac_cv_target=i686-pc-linux-gnu
ac_cv_target_alias=i686-pc-linux-gnu
ac_cv_type_off_t=yes
ac_cv_type_signal=void
ac_cv_type_size_t=yes
ac_cv_working_alloca_h=yes

## ----------------- ##
## Output variables. ##
## ----------------- ##

ALLOCA=''
ANSI2KNR=''
AWK='gawk'
CC='gcc'
CFLAGS='-O2'
COMPAT32BITFLAGS=''
CPP='gcc -E'
CPPFLAGS=''
CXX='g++'
CXXFLAGS=''
DEFS=''
ECHO_C=''
ECHO_N='-n'
ECHO_T=''
EGREP='grep -E'
ENABLE_ACCENTFOLD='1'
EXEEXT=''
INSTALL_DATA='${INSTALL} -m 644'
INSTALL_PROGRAM='${INSTALL}'
INSTALL_SCRIPT='${INSTALL}'
LDFLAGS=''
LIBOBJS=' rx.o'
LIBS='-lcrypt -lm -lg '
LN_S='ln -s'
LTLIBOBJS=''
MICO_DIR='default'
MICO_VER=''
MODULEDIRS=''
OBJEXT='o'
PACKAGE='gsdl'
PACKAGE_BUGREPORT=''
PACKAGE_NAME=''
PACKAGE_STRING=''
PACKAGE_TARNAME=''
PACKAGE_VERSION=''
PATH_SEPARATOR=':'
RANLIB='ranlib'
SET_MAKE=''
SHELL='/bin/sh'
STATIC='-static '
U=''
USE_APACHE_HTTPD='0'
USE_CORBA='0'
USE_FASTCGI='0'
USE_LANGACTION=''
USE_SQLITE='1'
USE_YAZ='1'
USE_Z3950='1'
VERSION='2.82-svn'
YACC='yacc'
ac_ct_CC='gcc'
ac_ct_CXX='g++'
ac_ct_RANLIB='ranlib'
bindir='${exec_prefix}/bin'
build='i686-pc-linux-gnu'
build_alias=''
build_cpu='i686'
build_os='linux-gnu'
build_vendor='pc'
datadir='${prefix}/share'
exec_prefix='NONE'
gsdlos=''
host='i686-pc-linux-gnu'
host_alias=''
host_cpu='i686'
host_os='linux-gnu'
host_vendor='pc'
includedir='${prefix}/include'
infodir='${prefix}/info'
libdir='${exec_prefix}/lib'
libexecdir='${exec_prefix}/libexec'
localstatedir='${prefix}/var'
mandir='${prefix}/man'
oldincludedir='/usr/include'
prefix='NONE'
program_transform_name='s,x,x,'
sbindir='${exec_prefix}/sbin'
sharedstatedir='${prefix}/com'
subdirs=''
sysconfdir='${prefix}/etc'
target='i686-pc-linux-gnu'
target_alias=''
target_cpu='i686'
target_os='linux-gnu'
target_vendor='pc'

## ----------- ##
## confdefs.h. ##
## ----------- ##

#define ENABLE_ACCENTFOLD $ENABLE_ACCENTFOLD
#define ENABLE_NLS 1
#define HAVE_ALLOCA 1
#define HAVE_ALLOCA_H 1
#define HAVE_CRYPT_H 1
#define HAVE_DIRENT_H 1
#define HAVE_FCNTL_H 1
#define HAVE_FGETC_DECL 1
#define HAVE_FREAD_DECL 1
#define HAVE_FTIME 1
#define HAVE_FTRUNCATE 1
#define HAVE_GETPAGESIZE 1
#define HAVE_GETRUSAGE 1
#define HAVE_INTTYPES_H 1
#define HAVE_LIBCRYPT 1
#define HAVE_LIBG 1
#define HAVE_LIBM 1
#define HAVE_LIMITS_H 1
#define HAVE_MALLINFO 1
#define HAVE_MEMORY_H 1
#define HAVE_MEMORY_H 1
#define HAVE_SELECT 1
#define HAVE_SETBUFFER 1
#define HAVE_STDINT_H 1
#define HAVE_STDLIB_H 1
#define HAVE_STRCASECMP 1
#define HAVE_STRERROR 1
#define HAVE_STRFTIME 1
#define HAVE_STRINGS_H 1
#define HAVE_STRING_H 1
#define HAVE_STRING_H 1
#define HAVE_STRSTR 1
#define HAVE_STRTOL 1
#define HAVE_SYS_PROCFS_H 1
#define HAVE_SYS_STAT_H 1
#define HAVE_SYS_STAT_H 1
#define HAVE_SYS_TIME_H 1
#define HAVE_SYS_TYPES_H 1
#define HAVE_TIMES 1
#define HAVE_UNISTD_H 1
#define HAVE_UNISTD_H 1
#define HAVE_VALLOC 1
#define HAVE_VPRINTF 1
#define MICO_DIR "default"
#define PACKAGE "gsdl"
#define PACKAGE_BUGREPORT ""
#define PACKAGE_NAME ""
#define PACKAGE_STRING ""
#define PACKAGE_TARNAME ""
#define PACKAGE_VERSION ""
#define PROTOTYPES 1
#define RETSIGTYPE void
#define STDC_HEADERS 1
#define STDC_HEADERS 1
#define TIME_WITH_SYS_TIME 1
#define USE_APACHE_HTTPD $USE_APACHE_HTTPD
#define USE_CORBA 0
#define USE_SQLITE $USE_SQLITE
#define USE_YAZ $USE_YAZ
#define VERSION "2.82-svn"
#endif
#ifdef __cplusplus
void exit (int);

configure: exit 1